program: Gaussian 09
title: 000056003
version: EM64L-G09RevD.01
frameworkgroup: C1[X(C26H27N3O4)]
method: RPBEPBE
basis: SDD
operation: Freq
keyword: #p
keyword: freq=noraman
keyword: PBEPBE/SDD
title: #p freq=noraman PBEPBE/SDD
converged: YES YES NO NO
title: Mulliken charges:
elementType: O O O O N N N C C C C C C C C C C C C C C C C C C C C C C C C C C H H H H H H H H H H H H H H H H H H H H H H H H H H H
charge: -0.287964 -0.261167 -0.283400 -0.273845 -0.176868 -0.146398 -0.478313 -0.398761 -0.418828 -0.401646 -0.366005 0.439573 0.144207 0.253906 -0.370662 -0.367999 -0.228621 -0.229166 -0.362387 -0.294828 -0.269050 -0.464285 -0.379698 0.502019 0.122238 0.308646 -0.483035 -0.386229 0.221138 0.234142 -0.347861 -0.519065 -0.535579 0.217952 0.230510 0.216877 0.232881 0.259144 0.216466 0.253701 0.237012 0.230665 0.232323 0.218459 0.218122 0.268023 0.240734 0.225064 0.220876 0.312191 0.312607 0.298150 0.214133 0.242269 0.234826 0.213447 0.256009 0.230617 0.248769 0.223962
chargesum: 0.00000
title: Mulliken charges with hydrogens summed into heavy atoms:
elementType: O O O O N N N C C C C C C C C C C C C C C C C C C C C C C C C C C
charge: -0.287964 -0.261167 -0.283400 -0.273845 -0.176868 -0.146398 -0.165705 0.049701 0.030930 0.073965 0.124708 0.439573 0.144207 0.253906 -0.139997 -0.135676 -0.010163 -0.011044 -0.094364 -0.054094 -0.043986 -0.243409 -0.067507 0.502019 0.122238 0.308646 -0.184885 -0.172096 0.221138 0.234142 -0.105592 0.185217 0.167769
polarizability: 5.86286205e+02 -6.45777063e+00 2.55025418e+02 2.20914077e+01 1.53079619e+01 2.49043572e+02
1716.lowfreq: -11.5477 -5.5935 -1.9930 -0.0017 0.0004 0.0011 4.1321 11.1515 16.7190
frequency: -2.2682 11.0756 16.3190 28.4232 33.5346 49.8735 53.5570 63.3274 72.9379 83.1614 92.9678 99.6976 118.8193 126.1988 130.4591 142.4754 161.9385 170.0810 183.8541 193.3749 210.5401 226.4206 234.2250 245.4547 251.1400 282.3318 290.6204 299.4666 317.4068 333.1384 342.3430 355.6184 378.5324 411.6402 413.2515 423.6160 431.6038 439.2572 468.5806 489.4451 502.9245 506.6110 511.8585 554.0819 562.7548 572.2342 597.5884 612.9029 623.5453 630.9772 634.2107 651.0201 679.7559 691.1488 695.9912 708.6004 714.5814 722.2139 749.3303 752.0815 760.1793 782.4390 800.3279 809.3283 837.5406 840.5335 856.2980 866.0931 870.1385 873.5642 890.1719 916.2729 929.3478 931.0260 953.8891 966.3843 968.6647 975.5698 976.5724 977.4814 986.7899 992.3952 1001.0994 1014.6845 1030.4144 1052.5013 1073.3698 1080.0913 1082.6120 1088.4510 1110.1342 1111.3220 1123.3770 1130.5276 1148.9271 1151.0655 1157.7807 1171.1372 1177.7456 1189.7815 1193.2014 1196.3389 1198.1683 1216.6653 1221.2496 1246.6682 1251.9222 1260.6293 1266.9565 1277.1672 1279.3545 1309.6794 1331.5046 1339.5363 1356.2498 1357.5677 1361.3992 1361.9839 1379.0747 1379.7302 1384.7328 1388.4914 1402.6751 1417.5974 1432.7780 1441.0721 1448.2914 1456.7131 1468.6707 1470.7362 1471.4296 1476.0160 1479.5158 1485.3338 1487.5287 1489.3871 1498.4869 1502.8791 1509.9091 1540.6899 1563.2667 1575.8337 1587.3589 1605.9795 1610.0869 1621.6398 1622.8519 2922.6968 2928.7102 2967.7876 2971.6916 2978.8648 2985.4768 3016.3955 3032.7107 3059.8671 3063.2299 3078.9116 3087.6469 3112.7670 3121.1076 3124.4664 3127.4284 3130.8057 3131.1142 3143.7522 3149.3033 3154.0395 3162.2642 3164.7577 3167.5302 3174.2721 3195.5434 3531.9410
redmass: 4.7664 5.9840 4.1614 4.5594 5.5052 4.5285 5.4837 2.2870 5.2863 4.3585 3.7149 4.3175 3.7611 2.7720 3.7474 2.7382 4.0821 3.8601 3.6723 2.8238 4.0639 5.2400 1.8585 2.3172 3.7303 2.3090 4.3466 3.6711 4.9393 4.8752 3.0474 4.6584 5.5299 3.1532 2.9696 4.6542 4.0390 5.0901 3.8392 3.2913 4.0083 4.0521 2.9162 4.9456 4.5277 5.8797 2.8471 6.2479 4.4348 4.0744 4.8580 1.3539 3.8009 1.8376 5.3974 4.4008 4.1873 4.3729 3.7704 1.8752 4.2272 4.5165 1.9135 1.2772 1.9872 2.3063 1.7311 1.9975 1.5213 2.3653 6.6324 1.4389 1.4604 3.6905 1.3748 1.3963 1.7982 1.8084 3.0642 6.7949 5.7606 1.3337 2.8434 2.4625 2.1380 1.9845 2.1088 2.3575 2.1514 1.6303 1.2372 1.2574 1.4246 2.1699 1.7627 1.7440 1.5339 1.0586 2.8478 1.1589 1.8620 1.6610 1.1337 1.2351 1.8076 1.8266 2.7365 1.5415 2.7020 1.5177 1.6903 1.4408 1.4215 1.3300 1.6757 1.6103 2.6709 1.6304 2.9851 3.1278 3.7952 3.6184 3.4209 3.8710 1.2578 1.3190 2.5711 1.0714 1.0500 1.1049 1.1288 1.1108 1.0742 1.9691 1.1514 1.1389 2.7463 2.1228 3.0690 7.4659 7.2763 6.0273 6.5052 4.5478 5.9856 6.1573 6.4015 1.0686 1.0700 1.0326 1.0673 1.0343 1.0662 1.0940 1.0917 1.1044 1.0969 1.0951 1.0979 1.0898 1.0843 1.0887 1.0882 1.1026 1.1019 1.0903 1.0913 1.0946 1.0946 1.0933 1.1008 1.0921 1.0946 1.0757
irintensity: 1.2981 0.1184 1.5609 0.8771 0.6653 0.6135 2.0594 5.6962 5.6272 2.8413 0.8336 2.8535 9.4286 0.8135 0.3829 2.2074 4.0417 2.8022 4.5107 4.5601 2.8857 0.3110 1.8882 2.7413 0.0776 8.7657 4.2684 16.1820 3.7976 0.2775 5.7465 1.0738 17.7521 2.5201 1.4651 14.2392 3.5468 0.8731 4.0339 3.6582 11.1391 13.4970 9.4591 7.0911 8.2051 4.5232 2.6464 0.3470 3.9798 11.8282 5.9384 37.3756 10.0029 43.7934 23.7988 8.7788 0.6574 35.0583 15.3144 81.8855 19.0257 22.4374 19.0255 0.3216 35.2567 6.4681 4.2096 33.0165 12.5464 23.4012 17.5039 1.6392 23.4686 13.8422 0.0062 4.9418 0.4272 3.9785 2.4374 102.1232 71.3935 4.0930 81.1016 23.2275 11.3916 1.3515 3.9079 13.6587 1.0912 4.3666 8.5180 0.1046 62.1986 63.2674 6.0100 14.6306 30.7305 0.7388 34.4153 112.2685 23.0322 12.9878 3.2628 177.4826 31.5276 13.8256 600.5341 49.7806 21.3765 40.2214 116.4968 89.8484 0.9686 6.0124 115.3785 31.6137 348.3416 16.3146 296.1822 77.2889 234.6023 11.4541 5.8863 21.9198 0.2852 23.2212 0.0672 20.6996 15.3720 38.8779 181.9952 63.5670 79.6744 417.6927 78.5699 18.2081 17.9585 117.4091 237.7407 172.7308 81.0540 10.9946 82.4077 146.6444 34.1183 311.7378 29.7150 92.9005 27.3617 68.9385 36.4482 91.1798 23.2320 30.4488 31.2153 40.1578 17.0128 13.7686 39.1409 23.4983 12.1479 22.4010 9.1450 13.8341 19.4548 14.5453 39.9963 39.7041 2.8490 10.9646 9.5076 4.6264 7.8653 10.5787
temp: 298.150 k
press: 1.00000 atm
elementType: 8 8 8 8 7 7 7 6 6 6 6 6 6 6 6 6 6 6 6 6 6 6 6 6 6 6 6 6 6 6 6 6 6 1 1 1 1 1 1 1 1 1 1 1 1 1 1 1 1 1 1 1 1 1 1 1 1 1 1 1
symmnumber: 1
zpe: 1261565.2 jmol-1
zpe.correction: 0.480505 hartree
zpe.thermalcorrener: 0.510140 hartree
zpe.thermalcorrenthalpy: 0.511084 hartree
zpe.thermalcorrgfe: 0.417051 hartree
zpe.sumelectzpe: -1469.725964 hartree
zpe.sumelectthermal: -1469.696329 hartree
zpe.sumelectthermalent: -1469.695384 hartree
zpe.sumelectthermalfe: -1469.789418 hartree
dipole: 6.2571 0.7090 4.0494
dipole: 7.4868
quadrupole: -138.8557 -216.0052 -180.1950
quadrupole: 21.8173 30.1287 -1.1780
quadrupole: 39.4963 -37.6532 -1.8430 21.8173 30.1287 -1.1780
hfenergy: -1470.2064686 hartree
pointgroup: C01 [X(C26H27N3O4)]
dipole: 2.426724 -0.6771497 1.5259865 debye
polarizability: 585.2213143|-21.2846926|239.4358369|20.9106873|8.0859449|265.6980438 unknown
InChI: InChI=1S/C26H27N3O4/c1-32-23-13-10-20(18-24(23)33-2)25(30)27-21-11-8-19(9-12-21)26(31)29-16-14-28(15-17-29)22-6-4-3-5-7-22/h3-13,18,27H,14-17H2,1-2H3
charge 0 multiplicity 1
60 atoms
O  -2.987635 2.999638 1.89526
O  3.132618 -0.096472 -1.531536
O  8.113528 -0.704142 -2.051256
O  9.110561 -1.324273 0.539093
N  -6.141289 -0.188134 -0.218196
N  -3.744406 1.33514 0.474932
N  2.83835 0.509642 0.718528
C  -4.923475 -0.848706 0.283446
C  -6.076887 1.274378 -0.401306
C  -3.671585 -0.030476 -0.094787
C  -5.1053 1.915952 0.603191
C  -7.302557 -0.920214 -0.512254
C  -2.719537 1.99457 1.153067
C  -1.300462 1.527347 0.982137
C  -8.374961 -0.338913 -1.259611
C  -7.451341 -2.274111 -0.074313
C  -9.538797 -1.080891 -1.544651
C  -8.618371 -3.004372 -0.376535
C  -0.422841 1.676563 2.088272
C  -0.761322 1.062532 -0.245069
C  -9.676203 -2.41993 -1.110831
C  0.932144 1.328499 1.981056
C  0.600712 0.727495 -0.376195
C  1.460336 0.844004 0.750086
C  3.599458 0.031695 -0.357974
C  5.02808 -0.3021 -0.030063
C  5.950888 -0.326955 -1.105415
C  5.489267 -0.619583 1.27237
C  7.307149 -0.639382 -0.90707
C  7.762417 -0.967338 0.412747
C  6.843243 -0.949391 1.489253
C  9.406189 0.014322 -2.043369
C  9.585002 -1.754368 1.859326
H  -4.952862 -0.999172 1.385483
H  -4.827755 -1.847202 -0.184678
H  -5.786352 1.548759 -1.439664
H  -7.076631 1.708478 -0.216502
H  -2.774273 -0.54105 0.290703
H  -3.593221 0.005419 -1.200321
H  -5.040199 3.004664 0.434055
H  -5.479308 1.778276 1.637355
H  -8.290834 0.681892 -1.64508
H  -6.670516 -2.749412 0.527562
H  -10.341263 -0.608418 -2.123526
H  -8.704519 -4.038551 -0.02244
H  -0.823889 2.085177 3.021116
H  -1.399792 0.994631 -1.132484
H  -10.581489 -2.991664 -1.338984
H  1.591768 1.43956 2.851639
H  1.01313 0.392034 -1.328792
H  3.347072 0.679011 1.588813
H  5.602337 -0.107498 -2.118698
H  4.801073 -0.672415 2.124486
H  7.171853 -1.218795 2.497115
H  9.807247 -0.12515 -3.058422
H  9.244487 1.092131 -1.849049
H  10.091539 -0.408219 -1.29151
H  9.031089 -2.646111 2.20893
H  10.644345 -2.009151 1.71156
H  9.496487 -0.940052 2.603802
