program: Orca
programVersion: 5.0.2
elementType: S O N C C C C C C C C C C C C C C C H H H H H H H H H H H H H H H H H H H H H H H
charge: 0
multiplicity: 1
keywords: wb97x-d3
keywords: def2-TZVPP
keywords: def2/J RIJCOSX
keywords: DEFGRID2
keywords: scfconv7
keywords: smallprint printgap noloewdin
keywords: NOSOSCF
formula: C15H23NOS
InChI: InChI=1/C15H23NOS/c1-5-16(13(4)12(2)3)15(17)18-11-14-9-7-6-8-10-14/h6-10,12-13H,5,11H2,1-4H3
41 atoms
S  -0.45833 2.199304 0.596059
O  0.302249 0.852493 -1.524935
N  1.628054 0.544124 0.28847
C  2.48315 -0.446143 -0.391099
C  1.713731 -1.735031 -0.741836
C  3.259353 0.148728 -1.562034
C  2.679232 -2.810684 -1.231035
C  0.911855 -2.252764 0.449152
C  1.99562 0.914987 1.647306
C  0.587937 1.080644 -0.36421
C  3.000856 2.05267 1.695702
C  -2.038129 1.889122 -0.257964
C  -2.502026 0.472579 -0.087637
C  -2.52748 -0.403845 -1.168176
C  -2.884749 0.000561 1.167635
C  -2.909819 -1.728862 -0.997228
C  -3.271301 -1.319686 1.339525
C  -3.277697 -2.192119 0.257143
H  3.219092 -0.723307 0.368338
H  1.018082 -1.520396 -1.556482
H  3.663042 1.127848 -1.300124
H  4.106626 -0.48767 -1.814527
H  2.651157 0.261587 -2.458111
H  3.168971 -2.53772 -2.166262
H  3.459095 -3.01659 -0.492997
H  2.146268 -3.745784 -1.412383
H  0.167926 -1.536115 0.801173
H  0.374186 -3.164334 0.18232
H  1.564385 -2.494672 1.293059
H  1.100424 1.173663 2.212916
H  2.404411 0.029646 2.134254
H  2.607846 2.950586 1.215983
H  3.237231 2.302833 2.730669
H  3.933961 1.785093 1.197682
H  -1.961057 2.173302 -1.305408
H  -2.726991 2.589772 0.216621
H  -2.24412 -0.050781 -2.151426
H  -2.87114 0.67022 2.020094
H  -2.916776 -2.398703 -1.847865
H  -3.565066 -1.671315 2.320606
H  -3.571207 -3.225451 0.392123
elementType: S O N C H
totalener: -1113.73434720 hartree
nucrepener: 1552.13899773 hartree
electener: -2665.87334494 hartree
oneelecener: -4605.11677321 hartree
twoeener: 1939.24342828 hartree
cpcmener: -0.01947946 hartree
kineticenergy: 1109.64420564 hartree
xcener: -91.212397315176 hartree
chargesum: 0.0000000
charge: -0.136931 -0.496869 -0.094924 0.046231 0.089998 -0.314199 -0.309351 -0.318339 -0.052342 0.283857 -0.251369 -0.056773 0.050593 -0.191628 -0.211571 -0.140464 -0.138332 -0.180307 0.083036 0.045028 0.097941 0.104365 0.096699 0.096848 0.087476 0.091811 0.071622 0.101116 0.095822 0.099048 0.093518 0.079256 0.098754 0.090051 0.115375 0.141877 0.134064 0.131795 0.155412 0.155807 0.155999
qa: -0.1369 -0.4969 -0.0949 0.0462 0.0900 -0.3142 -0.3094 -0.3183 -0.0523 0.2839 -0.2514 -0.0568 0.0506 -0.1916 -0.2116 -0.1405 -0.1383 -0.1803 0.0830 0.0450 0.0979 0.1044 0.0967 0.0968 0.0875 0.0918 0.0716 0.1011 0.0958 0.0990 0.0935 0.0793 0.0988 0.0901 0.1154 0.1419 0.1341 0.1318 0.1554 0.1558 0.1560
va: 2.2859 2.0131 3.1155 3.8356 3.7315 3.9390 3.9497 3.9392 3.8388 4.3007 3.9359 3.8388 3.5135 3.9105 3.9665 3.8653 3.8797 3.9014 1.0010 1.0418 1.0045 0.9979 1.0132 1.0009 1.0005 1.0043 1.0091 1.0049 1.0075 1.0270 0.9999 1.0084 1.0093 1.0012 1.0302 1.0012 1.0186 1.0145 0.9915 0.9908 0.9913
dispcorr: -0.022577892 hartree
energy: -1113.756925092167
dipole: 17.92778 -17.15488 0.77290 -11.18149 10.71909 -0.46240 0.79889 0.42657 1.22546
magnitude: 1.52084 au
magnitude: 3.86566 debye
