program: Orca
programVersion: 5.0.2
elementType: S O N C C C C C C C C C C C C C C C H H H H H H H H H H H H H H H H H H H H H H H
charge: 0
multiplicity: 1
keywords: wb97x-d3
keywords: def2-TZVPP
keywords: def2/J RIJCOSX
keywords: DEFGRID2
keywords: scfconv7
keywords: smallprint printgap noloewdin
keywords: NOSOSCF
formula: C15H23NOS
InChI: InChI=1/C15H23NOS/c1-5-16(13(4)12(2)3)15(17)18-11-14-9-7-6-8-10-14/h6-10,12-13H,5,11H2,1-4H3
41 atoms
S  -0.496675 2.260295 -0.178727
O  0.427715 0.306554 -1.667443
N  1.602345 0.645192 0.239382
C  2.513419 -0.485803 -0.016724
C  1.783756 -1.843463 0.002083
C  3.38711 -0.274721 -1.250075
C  2.797724 -2.983891 -0.0043
C  0.857494 -1.9731 1.207379
C  1.853125 1.438672 1.434265
C  0.618179 0.91168 -0.629512
C  2.859995 2.552273 1.205576
C  -1.994935 1.66084 -1.025637
C  -2.48993 0.365444 -0.453211
C  -2.992632 0.312127 0.846419
C  -2.430511 -0.809951 -1.195852
C  -3.417318 -0.889478 1.392165
C  -2.85052 -2.016258 -0.648897
C  -3.341179 -2.060861 0.647485
H  3.182937 -0.483236 0.847624
H  1.179977 -1.932597 -0.904002
H  2.859605 -0.474023 -2.181672
H  3.765213 0.747926 -1.285441
H  4.254499 -0.933407 -1.213596
H  3.386762 -3.014301 -0.921516
H  3.492781 -2.908437 0.836396
H  2.288807 -3.94577 0.079115
H  0.07087 -1.216938 1.217266
H  0.363187 -2.946081 1.205691
H  1.410427 -1.889501 2.14696
H  0.913677 1.845218 1.808543
H  2.211693 0.763036 2.21105
H  2.518135 3.24744 0.437074
H  3.009726 3.118552 2.12554
H  3.829202 2.157751 0.89726
H  -1.816622 1.593124 -2.097498
H  -2.717432 2.463943 -0.867115
H  -3.046686 1.217991 1.439386
H  -2.052712 -0.785001 -2.209791
H  -3.805852 -0.913653 2.402478
H  -2.790482 -2.92207 -1.238974
H  -3.664537 -3.000819 1.076441
elementType: S O N C H
totalener: -1113.73463077 hartree
nucrepener: 1550.72851334 hartree
electener: -2664.46314410 hartree
oneelecener: -4602.30078515 hartree
twoeener: 1937.83764104 hartree
cpcmener: -0.01948917 hartree
kineticenergy: 1109.64644476 hartree
xcener: -91.212858798364 hartree
chargesum: 0.0000000
charge: -0.136023 -0.496732 -0.095466 0.046248 0.089852 -0.314995 -0.307461 -0.313402 -0.052351 0.284441 -0.251071 -0.056841 0.048757 -0.210555 -0.190131 -0.140363 -0.142015 -0.178337 0.083070 0.044330 0.096208 0.098123 0.104697 0.096230 0.086574 0.091393 0.069665 0.100604 0.094721 0.098238 0.093350 0.079287 0.098827 0.089879 0.115731 0.142325 0.132071 0.133980 0.156072 0.155183 0.155891
qa: -0.1360 -0.4967 -0.0955 0.0462 0.0899 -0.3150 -0.3075 -0.3134 -0.0524 0.2844 -0.2511 -0.0568 0.0488 -0.2106 -0.1901 -0.1404 -0.1420 -0.1783 0.0831 0.0443 0.0962 0.0981 0.1047 0.0962 0.0866 0.0914 0.0697 0.1006 0.0947 0.0982 0.0933 0.0793 0.0988 0.0899 0.1157 0.1423 0.1321 0.1340 0.1561 0.1552 0.1559
va: 2.2878 2.0133 3.1152 3.8371 3.7321 3.9405 3.9492 3.9409 3.8397 4.2992 3.9344 3.8368 3.5141 3.9652 3.9097 3.8816 3.8699 3.9030 1.0004 1.0414 1.0134 1.0042 0.9980 1.0009 1.0008 1.0046 1.0092 1.0052 1.0074 1.0268 0.9998 1.0084 1.0093 1.0012 1.0303 1.0011 1.0143 1.0190 0.9907 0.9917 0.9912
dispcorr: -0.022481622 hartree
energy: -1113.757112391633
dipole: 17.85634 -17.18496 0.67138 -9.87174 9.86077 -0.01097 5.84386 -4.49259 1.35126
magnitude: 1.50890 au
magnitude: 3.83533 debye
