program: Orca
programVersion: 5.0.2
elementType: S O N C C C C C C C C C C C C C C C H H H H H H H H H H H H H H H H H H H H H H H
charge: 0
multiplicity: 1
keywords: wb97x-d3
keywords: def2-TZVPP
keywords: def2/J RIJCOSX
keywords: DEFGRID2
keywords: scfconv7
keywords: smallprint printgap noloewdin
keywords: NOSOSCF
formula: C15H23NOS
InChI: InChI=1/C15H23NOS/c1-5-16(13(4)12(2)3)15(17)18-11-14-9-7-6-8-10-14/h6-10,12-13H,5,11H2,1-4H3
41 atoms
S  -0.461271 2.171575 0.574823
O  0.331768 0.817278 -1.529844
N  1.640797 0.533772 0.298513
C  2.523309 -0.438951 -0.372519
C  1.783048 -1.739894 -0.741158
C  3.30566 0.176279 -1.528906
C  2.775891 -2.800202 -1.208167
C  0.961895 -2.271988 0.429667
C  1.983492 0.909154 1.663024
C  0.60086 1.054231 -0.36717
C  2.957129 2.073032 1.729927
C  -2.024955 1.875194 -0.312268
C  -2.52614 0.47446 -0.11875
C  -2.513586 -0.44081 -1.167004
C  -2.98507 0.056517 1.130119
C  -2.934657 -1.750226 -0.969192
C  -3.410494 -1.247794 1.328109
C  -3.379587 -2.159226 0.278963
H  3.252688 -0.706417 0.396703
H  1.103478 -1.536412 -1.571777
H  3.696835 1.156032 -1.251542
H  4.162238 -0.449215 -1.778872
H  2.705812 0.292641 -2.43013
H  3.534902 -3.00225 -0.447693
H  2.25941 -3.739835 -1.412182
H  3.290676 -2.514819 -2.125982
H  0.454051 -3.197065 0.151213
H  1.595482 -2.495436 1.292424
H  0.190839 -1.572854 0.756842
H  1.074882 1.139629 2.219543
H  2.411835 0.032824 2.149545
H  3.174607 2.321931 2.769375
H  3.902688 1.83296 1.241584
H  2.547221 2.964062 1.251823
H  -1.911884 2.131319 -1.364184
H  -2.7108 2.602707 0.126112
H  -2.171372 -0.130966 -2.145884
H  -3.003051 0.756789 1.957507
H  -2.911476 -2.45092 -1.794311
H  -3.765107 -1.555866 2.303639
H  -3.703423 -3.18044 0.434759
elementType: S O N C H
totalener: -1113.73470910 hartree
nucrepener: 1547.55370320 hartree
electener: -2661.28841230 hartree
oneelecener: -4595.93080277 hartree
twoeener: 1934.64239047 hartree
cpcmener: -0.01934320 hartree
kineticenergy: 1109.64660817 hartree
xcener: -91.212696411196 hartree
chargesum: -0.0000000
charge: -0.136142 -0.498029 -0.095484 0.046715 0.087936 -0.314171 -0.308634 -0.314801 -0.051263 0.284108 -0.252113 -0.055385 0.045133 -0.189874 -0.210114 -0.145685 -0.140172 -0.175163 0.082544 0.045210 0.097575 0.104247 0.096726 0.087029 0.091802 0.096622 0.100527 0.094446 0.072739 0.098968 0.093327 0.098858 0.090419 0.078851 0.116253 0.141732 0.134502 0.132978 0.155520 0.155830 0.156431
qa: -0.1361 -0.4980 -0.0955 0.0467 0.0879 -0.3142 -0.3086 -0.3148 -0.0513 0.2841 -0.2521 -0.0554 0.0451 -0.1899 -0.2101 -0.1457 -0.1402 -0.1752 0.0825 0.0452 0.0976 0.1042 0.0967 0.0870 0.0918 0.0966 0.1005 0.0944 0.0727 0.0990 0.0933 0.0989 0.0904 0.0789 0.1163 0.1417 0.1345 0.1330 0.1555 0.1558 0.1564
va: 2.2894 2.0105 3.1158 3.8363 3.7337 3.9398 3.9492 3.9387 3.8387 4.2998 3.9345 3.8322 3.5197 3.9056 3.9704 3.8695 3.8874 3.9034 1.0008 1.0414 1.0046 0.9982 1.0133 1.0007 1.0043 1.0010 1.0054 1.0071 1.0092 1.0266 0.9999 1.0093 1.0011 1.0090 1.0308 1.0013 1.0194 1.0130 0.9917 0.9906 0.9909
dispcorr: -0.022276498 hartree
energy: -1113.756985597703
dipole: 18.16781 -17.40270 0.76511 -10.97171 10.53985 -0.43186 0.95774 0.27070 1.22844
magnitude: 1.51028 au
magnitude: 3.83883 debye
