program: Orca
programVersion: 5.0.2
elementType: S O N C C C C C C C C C C C C C C C H H H H H H H H H H H H H H H H H H H H H H H
charge: 0
multiplicity: 1
keywords: wb97x-d3
keywords: def2-TZVPP
keywords: def2/J RIJCOSX
keywords: DEFGRID2
keywords: scfconv7
keywords: smallprint printgap noloewdin
keywords: NOSOSCF
formula: C15H23NOS
InChI: InChI=1/C15H23NOS/c1-5-16(13(4)12(2)3)15(17)18-11-14-9-7-6-8-10-14/h6-10,12-13H,5,11H2,1-4H3
41 atoms
S  -0.4688 2.093549 0.558449
O  0.356639 0.716635 -1.521049
N  1.673851 0.51198 0.310192
C  2.60989 -0.410352 -0.359377
C  1.950401 -1.7541 -0.72532
C  3.352618 0.247525 -1.518626
C  3.008224 -2.755408 -1.180327
C  1.152674 -2.327944 0.441563
C  1.992849 0.901757 1.676653
C  0.617363 0.987156 -0.363513
C  2.933223 2.09225 1.75271
C  -2.003887 1.842124 -0.389587
C  -2.591613 0.481464 -0.160479
C  -2.529769 -0.50254 -1.142962
C  -3.193461 0.173661 1.059346
C  -3.042166 -1.772276 -0.906165
C  -3.710436 -1.090654 1.295132
C  -3.629401 -2.072049 0.314036
H  3.355335 -0.630839 0.409405
H  1.266071 -1.595199 -1.561862
H  3.679942 1.252238 -1.247069
H  4.247621 -0.323375 -1.764431
H  2.747324 0.319945 -2.420945
H  3.770077 -2.911994 -0.411884
H  2.549845 -3.723675 -1.388873
H  3.515516 -2.440604 -2.092653
H  0.324192 -1.684607 0.742562
H  0.72166 -3.293541 0.170604
H  1.785919 -2.48921 1.31828
H  1.072789 1.106198 2.224708
H  2.441622 0.038989 2.169144
H  3.890512 1.877151 1.275677
H  2.505396 2.972204 1.270117
H  3.132426 2.346434 2.794607
H  -1.824235 2.044311 -1.443753
H  -2.668894 2.624112 -0.019345
H  -2.079587 -0.278756 -2.101188
H  -3.25429 0.929681 1.834135
H  -2.979757 -2.527613 -1.67953
H  -4.177213 -1.311661 2.246816
H  -4.027565 -3.06159 0.499326
elementType: S O N C H
totalener: -1113.73570147 hartree
nucrepener: 1536.04431114 hartree
electener: -2649.78001262 hartree
oneelecener: -4572.88601297 hartree
twoeener: 1923.10600035 hartree
cpcmener: -0.01908059 hartree
kineticenergy: 1109.64657696 hartree
xcener: -91.212688180256 hartree
chargesum: -0.0000000
charge: -0.134106 -0.501849 -0.097640 0.049198 0.081901 -0.315301 -0.307436 -0.311771 -0.050579 0.285452 -0.253390 -0.052242 0.042476 -0.192010 -0.212199 -0.149705 -0.144833 -0.170573 0.082794 0.045935 0.097781 0.104160 0.096870 0.086299 0.091710 0.097006 0.080392 0.098875 0.090513 0.098786 0.093346 0.090548 0.079028 0.099094 0.117700 0.142109 0.136794 0.135134 0.155696 0.156775 0.157263
qa: -0.1341 -0.5018 -0.0976 0.0492 0.0819 -0.3153 -0.3074 -0.3118 -0.0506 0.2855 -0.2534 -0.0522 0.0425 -0.1920 -0.2122 -0.1497 -0.1448 -0.1706 0.0828 0.0459 0.0978 0.1042 0.0969 0.0863 0.0917 0.0970 0.0804 0.0989 0.0905 0.0988 0.0933 0.0905 0.0790 0.0991 0.1177 0.1421 0.1368 0.1351 0.1557 0.1568 0.1573
va: 2.2986 2.0028 3.1172 3.8328 3.7435 3.9405 3.9470 3.9394 3.8417 4.2967 3.9324 3.8151 3.5287 3.9085 3.9800 3.8785 3.8939 3.9058 0.9997 1.0400 1.0042 0.9984 1.0133 1.0008 1.0047 1.0008 1.0078 1.0063 1.0054 1.0259 0.9994 1.0010 1.0100 1.0092 1.0322 1.0016 1.0204 1.0104 0.9917 0.9903 0.9902
dispcorr: -0.021537061 hartree
energy: -1113.757238535766
dipole: 19.01087 -18.22552 0.78535 -10.41392 10.08799 -0.32593 1.04001 0.16647 1.20648
magnitude: 1.47601 au
magnitude: 3.75172 debye
