program: Orca
programVersion: 5.0.2
elementType: S O N C C C C C C C C C C C C C C C H H H H H H H H H H H H H H H H H H H H H H H
charge: 0
multiplicity: 1
keywords: wb97x-d3
keywords: def2-TZVPP
keywords: def2/J RIJCOSX
keywords: DEFGRID2
keywords: scfconv7
keywords: smallprint printgap noloewdin
keywords: NOSOSCF
formula: C15H23NOS
InChI: InChI=1/C15H23NOS/c1-5-16(13(4)12(2)3)15(17)18-11-14-9-7-6-8-10-14/h6-10,12-13H,5,11H2,1-4H3
41 atoms
S  -0.547757 1.443898 -0.602401
O  0.189645 -1.035532 -1.113966
N  1.632487 0.145916 0.185283
C  2.529207 -1.008858 0.359494
C  3.875643 -0.794827 -0.347762
C  2.664636 -1.361147 1.838635
C  4.793529 -1.995818 -0.139152
C  3.68556 -0.543897 -1.839733
C  1.985473 1.405846 0.829284
C  0.508134 -0.011497 -0.534856
C  2.600619 2.452509 -0.088383
C  -2.048158 0.74925 -1.362052
C  -3.024865 0.230801 -0.349563
C  -2.964591 -1.08366 0.108844
C  -4.008301 1.073984 0.162873
C  -3.865155 -1.540994 1.060662
C  -4.910337 0.617842 1.113797
C  -4.839895 -0.692118 1.567819
H  2.03746 -1.850037 -0.128696
H  4.36741 0.078987 0.096668
H  1.691183 -1.338274 2.330636
H  3.057306 -2.370933 1.953277
H  3.33493 -0.690341 2.379218
H  4.320038 -2.920618 -0.479114
H  5.716293 -1.873322 -0.709004
H  5.078219 -2.130592 0.90442
H  3.039935 0.310335 -2.04577
H  4.644742 -0.345473 -2.321439
H  3.247107 -1.415411 -2.332105
H  1.107166 1.81523 1.33408
H  2.690301 1.179085 1.627305
H  1.947645 2.716624 -0.919974
H  2.78674 3.363104 0.483224
H  3.553815 2.121134 -0.499074
H  -1.752631 -0.011095 -2.083257
H  -2.480805 1.578841 -1.922535
H  -2.211548 -1.756221 -0.281074
H  -4.07101 2.097777 -0.188053
H  -3.806217 -2.56573 1.405429
H  -5.670661 1.286126 1.498131
H  -5.542487 -1.05076 2.309265
elementType: S O N C H
totalener: -1113.73798378 hartree
nucrepener: 1487.78735656 hartree
electener: -2601.52534034 hartree
oneelecener: -4476.05592150 hartree
twoeener: 1874.53058115 hartree
cpcmener: -0.01925498 hartree
kineticenergy: 1109.64144703 hartree
xcener: -91.215737062916 hartree
chargesum: 0.0000000
charge: -0.122899 -0.514917 -0.107966 0.085434 0.047436 -0.322642 -0.306088 -0.307401 -0.077211 0.296286 -0.268874 -0.066234 0.035723 -0.192556 -0.216866 -0.148074 -0.140003 -0.176220 0.082221 0.044348 0.105654 0.102668 0.090455 0.091737 0.091302 0.095474 0.088921 0.101209 0.090529 0.104045 0.111895 0.085047 0.101337 0.091352 0.128926 0.140047 0.148323 0.137864 0.156676 0.156502 0.156542
qa: -0.1229 -0.5149 -0.1080 0.0854 0.0474 -0.3226 -0.3061 -0.3074 -0.0772 0.2963 -0.2689 -0.0662 0.0357 -0.1926 -0.2169 -0.1481 -0.1400 -0.1762 0.0822 0.0443 0.1057 0.1027 0.0905 0.0917 0.0913 0.0955 0.0889 0.1012 0.0905 0.1040 0.1119 0.0850 0.1013 0.0914 0.1289 0.1400 0.1483 0.1379 0.1567 0.1565 0.1565
va: 2.3159 1.9809 3.1241 3.7788 3.8103 3.9539 3.9412 3.9288 3.8556 4.2720 3.9009 3.7650 3.5980 3.9312 3.9869 3.9115 3.8815 3.9105 1.0450 1.0160 1.0076 0.9979 1.0000 1.0004 1.0048 1.0000 1.0034 1.0038 1.0065 1.0163 0.9947 1.0193 1.0107 0.9991 1.0320 1.0043 1.0195 1.0054 0.9919 0.9904 0.9908
dispcorr: -0.019630882 hartree
energy: -1113.757614665506
dipole: 25.48802 -24.54399 0.94403 -3.42465 4.15775 0.73310 2.55085 -1.63468 0.91617
magnitude: 1.50599 au
magnitude: 3.82791 debye
