program: Gaussian 09
title: 000055950
version: EM64L-G09RevD.01
frameworkgroup: C1[X(C8H3ClF3N3O2)]
method: RPBEPBE
basis: SDD
operation: Freq
keyword: #p
keyword: freq=noraman
keyword: PBEPBE/SDD
title: #p freq=noraman PBEPBE/SDD
converged: NO YES NO NO
title: Mulliken charges:
elementType: Cl F F F O O N N N C C C C C C C C H H H
charge: 0.050140 -0.111235 -0.150494 -0.150541 -0.185705 -0.244964 -0.396243 0.005251 0.026073 0.175014 0.245464 0.130303 0.329688 -0.376513 -0.370756 0.267629 -0.192805 0.387634 0.293524 0.268535
chargesum: 0.00000
title: Mulliken charges with hydrogens summed into heavy atoms:
elementType: Cl F F F O O N N N C C C C C C C C
charge: 0.050140 -0.111235 -0.150494 -0.150541 -0.185705 -0.244964 -0.008609 0.005251 0.026073 0.175014 0.245464 0.130303 0.329688 -0.376513 -0.077231 0.267629 0.075730
polarizability: 1.70447467e+02 -4.06555286e+00 1.84328037e+02 5.49774080e-05 1.57439109e-05 5.37992472e+01
1716.lowfreq: -23.2515 -5.4737 -3.0304 -1.6154 -0.0009 0.0014 0.0014 68.1709 87.0276
frequency: -23.1794 68.1629 87.0274 91.6642 95.8306 159.0952 190.0934 206.6580 218.6765 289.5144 305.5997 313.6341 353.3480 364.2948 415.2737 472.9190 480.5665 513.1870 535.8897 565.7014 589.2785 600.1617 666.5162 680.0077 688.1921 714.4614 750.6595 756.4755 780.6718 833.3322 913.0625 951.4127 966.7209 976.5259 977.0956 1041.2184 1086.6069 1122.1829 1164.5557 1197.1007 1235.2677 1239.1980 1303.6587 1328.5481 1354.1303 1398.2086 1430.1139 1470.8244 1520.9776 1581.9142 1636.9424 3172.9809 3189.4806 3526.9844
redmass: 18.4060 12.3800 12.3697 18.0199 9.7231 19.8774 8.8372 12.7396 8.4117 14.7728 17.3539 6.3684 11.9748 9.9153 10.8368 11.8478 10.6608 9.2015 6.7550 8.1196 4.4988 10.8205 7.8169 8.3143 7.5167 11.9065 12.5299 1.4112 3.9379 1.3854 10.6254 8.8441 1.3495 10.7728 5.5935 6.3342 4.3609 1.9045 3.4281 2.5648 2.1458 5.7390 3.1566 7.2763 11.7153 5.2043 9.0303 3.7257 7.4454 8.1192 10.2050 1.0891 1.0965 1.0824
irintensity: 0.0373 0.6074 2.1060 0.5840 0.8394 1.3014 7.9430 8.8978 5.6102 4.7080 2.3936 0.0167 2.0610 1.6774 8.2297 2.4876 0.3574 13.1221 0.0419 4.2782 0.0164 11.3934 3.6592 4.9631 7.6789 9.1949 14.7156 67.5602 20.7085 36.6284 42.4684 76.3373 7.2153 270.7904 26.6046 98.1593 162.4538 19.9184 168.9432 387.5031 94.7704 180.9079 224.6346 0.1719 46.5896 62.5689 29.5217 25.4289 32.6093 136.6935 28.3805 1.6877 2.6766 110.2757
temp: 298.150 k
press: 1.00000 atm
elementType: 17 9 9 9 8 8 7 7 7 6 6 6 6 6 6 6 6 1 1 1
symmnumber: 1
zpe: 290528.7 jmol-1
zpe.correction: 0.110657 hartree
zpe.thermalcorrener: 0.123713 hartree
zpe.thermalcorrenthalpy: 0.124657 hartree
zpe.thermalcorrgfe: 0.070084 hartree
zpe.sumelectzpe: -1379.659196 hartree
zpe.sumelectthermal: -1379.646140 hartree
zpe.sumelectthermalent: -1379.645195 hartree
zpe.sumelectthermalfe: -1379.699768 hartree
dipole: 2.8745 1.3165 -0.0002
dipole: 3.1617
quadrupole: -105.0075 -116.0036 -102.0500
quadrupole: 13.0884 0.0026 -0.0007
quadrupole: 2.6796 -8.3166 5.6370 13.0884 0.0026 -0.0007
hfenergy: -1379.7698525 hartree
pointgroup: C01 [X(C8H3Cl1F3N3O2)]
dipole: -1.0412322 -0.6805159 -0.0006804 debye
dipolederiv: -0.0809273 0.2199496 0.0000145 0.1269548 -0.8447025 -0.0001499 -0.0000014 -0.0001261 0.0074847 -0.6931409 0.2088254 0.0000542 0.2127631 -0.4867238 -0.0001693 -0.0000278 -0.0001394 -0.2572714 -0.5851335 -0.1490588 0.0919836 -0.2655167 -0.491362 0.2553451 0.1477522 0.2323225 -0.6235706 -0.5852164 -0.1488968 -0.0922458 -0.2652163 -0.4906866 -0.2552671 -0.1482624 -0.2322885 -0.6244038 -0.9017398 0.3739431 -0.0001687 0.2424666 -0.567809 0.0000311 -0.0002824 0.000123 -0.2132705 -0.5608841 -0.2977454 -0.000189 -0.0592377 -0.838575 -0.0001438 -0.0001105 -0.0001903 -0.2503045 -0.5843704 0.1613594 -0.0001359 -0.1377308 -0.4623903 -0.0001369 -0.0001991 -0.0000197 -0.1915678 -0.1453174 -0.048169 0.0000195 0.1453865 -0.3113183 0.0000293 0.0000478 -0.000032 -0.2110255 1.2567578 -0.3295464 0.0003253 -0.4783712 1.8994406 0.0001133 0.0003325 0.0001387 0.203741 0.2401095 -0.1645452 0.0000632 0.3530851 0.1680548 0.0001816 0.0001621 -0.0000447 0.0824114 0.0490498 0.0052201 -0.0000125 -0.1714487 -0.4759896 -0.0002079 -0.0000616 -0.0001406 0.0710252 -0.2013202 -0.3586788 -0.0001596 -0.3985713 0.4451293 -0.0000432 0.0000049 0.0000226 -0.0343594 0.0171946 0.1051077 0.0000116 0.3874437 -0.9584727 -0.000025 0.0000723 -0.0001692 0.0477228 0.5827124 -0.5073139 0.0001631 -0.0514187 1.4194651 0.0003476 0.0002591 0.0001739 -0.0640169 -0.1312626 0.1630816 0.0000138 -0.3864746 0.5494666 -0.0000296 -0.0000848 0.0001818 -0.0934698 2.280736 0.242437 0.0003833 0.354802 1.4701612 0.0000896 0.0005376 0.0000973 1.5614003 -0.3935207 0.4937843 -0.0000247 0.4213734 -0.4656474 0.0000937 -0.0000288 0.0001079 -0.096293 0.3097497 0.0694477 0.0000025 -0.0165555 0.3093635 -0.0000084 -0.0000099 0.0000388 0.3482042 0.0731817 0.006254 -0.0000405 0.0353167 0.1058127 0.0000003 -0.0000378 -0.0000079 0.1714515 0.0533417 -0.0454559 -0.0000578 -0.0490503 0.0267833 -0.0000506 -0.0000621 -0.0000482 0.1661121 unknown
polarizability: 171.9516998|-5.9284055|182.8237765|0.05056|0.0254271|53.7992749 unknown
InChI: InChI=1S/C8H3ClF3N3O2/c9-3-1-2-4(15(16)17)6-5(3)13-7(14-6)8(10,11)12/h1-2,14H
charge 0 multiplicity 1
20 atoms
Cl -0.60348 -3.952288 -0.001072
F  4.00086 -0.538287 0.001065
F  3.330351 1.319133 -1.131243
F  3.329927 1.317428 1.135685
O  -3.623514 2.177845 -0.001005
O  -1.423099 2.802543 -0.000051
N  0.589934 0.920228 0.000632
N  1.268612 -1.268699 0.000364
N  -2.366853 1.900823 -0.000478
C  -0.571458 0.166613 -0.000067
C  -0.135633 -1.204979 -0.000192
C  1.655644 0.014167 0.000828
C  -1.945655 0.501571 -0.000608
C  -1.10862 -2.232085 -0.000845
C  -2.893428 -0.54184 -0.001212
C  3.072377 0.496987 0.001502
C  -2.47867 -1.895312 -0.001338
H  0.595019 1.944817 0.000866
H  -3.955931 -0.283934 -0.001602
H  -3.226582 -2.69233 -0.001831
