program: Orca
programVersion: 5.0.2
elementType: S O N C C C C C C C C C C C C C C C H H H H H H H H H H H H H H H H H H H H H H H
charge: 0
multiplicity: 1
keywords: wb97x-d3
keywords: def2-TZVPP
keywords: def2/J RIJCOSX
keywords: DEFGRID2
keywords: scfconv7
keywords: smallprint printgap noloewdin
keywords: NOSOSCF
formula: C15H23NOS
InChI: InChI=1/C15H23NOS/c1-5-16(13(4)12(2)3)15(17)18-11-14-9-7-6-8-10-14/h6-10,12-13H,5,11H2,1-4H3
41 atoms
S  -0.499817 1.77987 0.484712
O  0.496227 0.400889 -1.531714
N  1.813979 0.471138 0.311841
C  2.896593 -0.312607 -0.311585
C  2.482456 -1.767923 -0.593197
C  3.521107 0.397728 -1.509287
C  3.690439 -2.585059 -1.044037
C  1.84328 -2.413644 0.631567
C  2.057072 0.96605 1.660158
C  0.708908 0.762911 -0.388216
C  2.823971 2.27692 1.684605
C  -1.935643 1.620598 -0.622196
C  -2.803794 0.450181 -0.270753
C  -2.527076 -0.826973 -0.756224
C  -3.898933 0.62337 0.571733
C  -3.326315 -1.904355 -0.402384
C  -4.700976 -0.453375 0.924812
C  -4.415611 -1.722187 0.439716
H  3.667411 -0.357482 0.462992
H  1.752379 -1.774617 -1.406604
H  2.925797 0.303851 -2.416044
H  3.657826 1.459859 -1.300635
H  4.507772 -0.014927 -1.716776
H  4.098205 -2.240634 -1.994871
H  4.4950 -2.551868 -0.304359
H  3.413323 -3.632378 -1.176906
H  1.561256 -3.44602 0.417309
H  2.535333 -2.434894 1.478099
H  0.938169 -1.896214 0.953602
H  1.112116 1.065336 2.19566
H  2.610805 0.196219 2.198106
H  3.808141 2.172444 1.225397
H  2.284787 3.063945 1.155431
H  2.972107 2.606569 2.713643
H  -1.58018 1.581893 -1.650302
H  -2.48155 2.556343 -0.50311
H  -1.683178 -0.981429 -1.415924
H  -4.127659 1.611234 0.955286
H  -3.098595 -2.889795 -0.788979
H  -5.550045 -0.299855 1.578925
H  -5.039889 -2.563444 0.712592
elementType: S O N C H
totalener: -1113.73703255 hartree
nucrepener: 1504.30459395 hartree
electener: -2618.04162650 hartree
oneelecener: -4509.18625193 hartree
twoeener: 1891.14462543 hartree
cpcmener: -0.01859074 hartree
kineticenergy: 1109.64165088 hartree
xcener: -91.212183047613 hartree
chargesum: -0.0000000
charge: -0.131938 -0.509613 -0.102546 0.046134 0.076864 -0.315483 -0.306143 -0.310158 -0.048297 0.289531 -0.256700 -0.060361 0.035643 -0.203284 -0.218052 -0.145815 -0.139001 -0.175325 0.085560 0.049327 0.097208 0.099598 0.104133 0.096619 0.087114 0.091710 0.097967 0.084981 0.087840 0.097975 0.096667 0.090461 0.079062 0.099535 0.128545 0.137937 0.154279 0.137957 0.156605 0.156484 0.156980
qa: -0.1319 -0.5096 -0.1025 0.0461 0.0769 -0.3155 -0.3061 -0.3102 -0.0483 0.2895 -0.2567 -0.0604 0.0356 -0.2033 -0.2181 -0.1458 -0.1390 -0.1753 0.0856 0.0493 0.0972 0.0996 0.1041 0.0966 0.0871 0.0917 0.0980 0.0850 0.0878 0.0980 0.0967 0.0905 0.0791 0.0995 0.1285 0.1379 0.1543 0.1380 0.1566 0.1565 0.1570
va: 2.3086 1.9899 3.1249 3.8329 3.7581 3.9399 3.9437 3.9352 3.8477 4.2844 3.9306 3.7595 3.6047 3.9236 3.9904 3.9079 3.8809 3.9114 0.9993 1.0372 1.0135 1.0036 0.9981 1.0009 1.0003 1.0050 1.0065 1.0034 1.0089 1.0214 0.9982 1.0008 1.0126 1.0090 1.0330 1.0053 1.0137 1.0054 0.9922 0.9904 0.9906
dispcorr: -0.020212910 hartree
energy: -1113.757245458736
dipole: 21.62783 -20.76415 0.86368 -8.21529 8.18448 -0.03082 1.49958 -0.34925 1.15034
magnitude: 1.43881 au
magnitude: 3.65716 debye
