program: Orca
programVersion: 5.0.2
elementType: S O N C C C C C C C C C C C C C C C H H H H H H H H H H H H H H H H H H H H H H H
charge: 0
multiplicity: 1
keywords: wb97x-d3
keywords: def2-TZVPP
keywords: def2/J RIJCOSX
keywords: DEFGRID2
keywords: scfconv7
keywords: smallprint printgap noloewdin
keywords: NOSOSCF
formula: C15H23NOS
InChI: InChI=1/C15H23NOS/c1-5-16(13(4)12(2)3)15(17)18-11-14-9-7-6-8-10-14/h6-10,12-13H,5,11H2,1-4H3
41 atoms
S  -0.511219 1.820681 -0.035993
O  0.583657 -0.053034 -1.53377
N  1.807509 0.550599 0.275489
C  2.925768 -0.351334 -0.059004
C  2.533495 -1.835841 0.049107
C  3.601934 0.017729 -1.376192
C  3.762906 -2.724206 -0.117439
C  1.849337 -2.13495 1.379038
C  1.983722 1.407938 1.439978
C  0.736639 0.616282 -0.528041
C  2.744346 2.68549 1.129614
C  -1.882112 1.354187 -1.138648
C  -2.793039 0.33048 -0.528952
C  -3.943126 0.73291 0.14555
C  -2.507407 -1.031604 -0.608581
C  -4.789746 -0.2005 0.727826
C  -3.351756 -1.965422 -0.026003
C  -4.49555 -1.554085 0.645625
H  3.657721 -0.166352 0.732544
H  1.837468 -2.077776 -0.757538
H  3.733767 1.097876 -1.449911
H  4.594762 -0.428328 -1.425096
H  3.043906 -0.318159 -2.248379
H  4.201323 -2.645181 -1.11239
H  4.538727 -2.475414 0.611414
H  3.497233 -3.772138 0.031516
H  2.506929 -1.917103 2.224843
H  0.930641 -1.562475 1.513303
H  1.580167 -3.190899 1.440828
H  1.013203 1.636344 1.881857
H  2.516176 0.828857 2.194775
H  3.753057 2.472742 0.773156
H  2.234492 3.280399 0.371299
H  2.83382 3.2953 2.029319
H  -1.464436 1.024073 -2.088349
H  -2.418361 2.285477 -1.324573
H  -4.181613 1.788019 0.214148
H  -1.621447 -1.367613 -1.131346
H  -5.681004 0.131449 1.245151
H  -3.116146 -3.019566 -0.099596
H  -5.154169 -2.284066 1.098557
elementType: S O N C H
totalener: -1113.73711730 hartree
nucrepener: 1502.51112874 hartree
electener: -2616.24824604 hartree
oneelecener: -4505.60095404 hartree
twoeener: 1889.35270799 hartree
cpcmener: -0.01859773 hartree
kineticenergy: 1109.65173519 hartree
xcener: -91.214175440031 hartree
chargesum: 0.0000000
charge: -0.131513 -0.509937 -0.103777 0.049510 0.075816 -0.315512 -0.304831 -0.310074 -0.048842 0.289677 -0.257766 -0.059411 0.029903 -0.214623 -0.200114 -0.140001 -0.147203 -0.175765 0.084891 0.048334 0.098720 0.103994 0.098139 0.096101 0.086591 0.091474 0.084811 0.088000 0.097711 0.098843 0.096689 0.090382 0.080059 0.099380 0.129396 0.138103 0.137773 0.154504 0.156805 0.156343 0.157420
qa: -0.1315 -0.5099 -0.1038 0.0495 0.0758 -0.3155 -0.3048 -0.3101 -0.0488 0.2897 -0.2578 -0.0594 0.0299 -0.2146 -0.2001 -0.1400 -0.1472 -0.1758 0.0849 0.0483 0.0987 0.1040 0.0981 0.0961 0.0866 0.0915 0.0848 0.0880 0.0977 0.0988 0.0967 0.0904 0.0801 0.0994 0.1294 0.1381 0.1378 0.1545 0.1568 0.1563 0.1574
va: 2.3106 1.9894 3.1279 3.8288 3.7593 3.9397 3.9444 3.9344 3.8492 4.2841 3.9304 3.7558 3.6118 3.9889 3.9228 3.8811 3.9096 3.9115 0.9998 1.0380 1.0038 0.9981 1.0137 1.0011 1.0004 1.0050 1.0035 1.0091 1.0065 1.0205 0.9982 1.0007 1.0129 1.0090 1.0328 1.0052 1.0055 1.0131 0.9903 0.9923 0.9905
dispcorr: -0.020130945 hartree
energy: -1113.757248248504
dipole: 21.64064 -20.83576 0.80487 -7.13326 7.45552 0.32227 4.69376 -3.55617 1.13759
magnitude: 1.43031 au
magnitude: 3.63556 debye
