program: Orca
programVersion: 5.0.2
elementType: S O N C C C C C C C C C C C C C C C H H H H H H H H H H H H H H H H H H H H H H H
charge: 0
multiplicity: 1
keywords: wb97x-d3
keywords: def2-TZVPP
keywords: def2/J RIJCOSX
keywords: DEFGRID2
keywords: scfconv7
keywords: smallprint printgap noloewdin
keywords: NOSOSCF
formula: C15H23NOS
InChI: InChI=1/C15H23NOS/c1-5-16(13(4)12(2)3)15(17)18-11-14-9-7-6-8-10-14/h6-10,12-13H,5,11H2,1-4H3
41 atoms
S  -0.517943 0.616206 -1.41767
O  0.235003 -1.50868 -0.053792
N  1.712664 0.21635 -0.032798
C  2.732513 -0.572422 0.671735
C  3.920041 -0.912078 -0.250102
C  3.154962 0.119102 1.961693
C  4.829538 -1.941711 0.415908
C  3.458158 -1.429057 -1.608428
C  2.040019 1.584356 -0.415009
C  0.557713 -0.379006 -0.376272
C  1.434068 2.647232 0.488012
C  -2.010832 -0.425746 -1.471869
C  -2.974374 -0.118336 -0.365737
C  -3.966247 0.841913 -0.552877
C  -2.893257 -0.765631 0.865453
C  -4.853577 1.154934 0.466835
C  -3.777541 -0.45099 1.887392
C  -4.759281 0.511463 1.693335
H  2.25383 -1.51302 0.943234
H  4.508885 -0.001214 -0.412014
H  2.285271 0.38628 2.562186
H  3.768415 -0.547455 2.566341
H  3.738826 1.023204 1.779059
H  5.27349 -1.575813 1.3418
H  4.281386 -2.858198 0.648402
H  5.652786 -2.212163 -0.247145
H  4.31686 -1.714267 -2.218675
H  2.823395 -2.311979 -1.504102
H  2.899664 -0.681629 -2.173843
H  3.125582 1.676097 -0.406034
H  1.753825 1.761154 -1.454684
H  0.34692 2.582278 0.521109
H  1.80933 2.570829 1.507748
H  1.694437 3.637428 0.11149
H  -1.705586 -1.470406 -1.478594
H  -2.457763 -0.211632 -2.443164
H  -4.047145 1.348564 -1.50787
H  -2.137016 -1.52188 1.02881
H  -5.620401 1.901184 0.301782
H  -3.700532 -0.963307 2.838099
H  -5.450114 0.754118 2.490606
elementType: S O N C H
totalener: -1113.73848185 hartree
nucrepener: 1491.47865696 hartree
electener: -2605.21713881 hartree
oneelecener: -4483.47299313 hartree
twoeener: 1878.25585432 hartree
cpcmener: -0.01910846 hartree
kineticenergy: 1109.65009451 hartree
xcener: -91.217168498015 hartree
chargesum: 0.0000000
charge: -0.124524 -0.515104 -0.107390 0.084963 0.056757 -0.321027 -0.307634 -0.300704 -0.078400 0.301316 -0.253713 -0.062628 0.030198 -0.216796 -0.191687 -0.139121 -0.146929 -0.176237 0.077104 0.039996 0.102305 0.106312 0.091417 0.094598 0.089536 0.091813 0.099176 0.088926 0.083342 0.111742 0.098662 0.080460 0.092162 0.095025 0.128793 0.141587 0.137744 0.148485 0.156038 0.156710 0.156730
qa: -0.1245 -0.5151 -0.1074 0.0850 0.0568 -0.3210 -0.3076 -0.3007 -0.0784 0.3013 -0.2537 -0.0626 0.0302 -0.2168 -0.1917 -0.1391 -0.1469 -0.1762 0.0771 0.0400 0.1023 0.1063 0.0914 0.0946 0.0895 0.0918 0.0992 0.0889 0.0833 0.1117 0.0987 0.0805 0.0922 0.0950 0.1288 0.1416 0.1377 0.1485 0.1560 0.1567 0.1567
va: 2.3158 1.9823 3.1115 3.7926 3.7981 3.9575 3.9485 3.9356 3.8792 4.2635 3.9161 3.7677 3.5978 3.9880 3.9307 3.8805 3.9105 3.9110 1.0456 1.0211 1.0042 1.0028 0.9956 1.0023 1.0007 1.0044 1.0068 1.0088 1.0073 0.9953 1.0075 1.0203 1.0013 1.0080 1.0325 1.0044 1.0055 1.0201 0.9906 0.9919 0.9908
dispcorr: -0.019646595 hartree
energy: -1113.758128446055
dipole: 23.91735 -22.92109 0.99626 0.25340 0.85098 1.10438 4.61777 -4.60655 0.01122
magnitude: 1.48739 au
magnitude: 3.78064 debye
