program: Orca
programVersion: 5.0.2
elementType: S O N C C C C C C C C C C C C C C C H H H H H H H H H H H H H H H H H H H H H H H
charge: 0
multiplicity: 1
keywords: wb97x-d3
keywords: def2-TZVPP
keywords: def2/J RIJCOSX
keywords: DEFGRID2
keywords: scfconv7
keywords: smallprint printgap noloewdin
keywords: NOSOSCF
formula: C15H23NOS
InChI: InChI=1/C15H23NOS/c1-5-16(13(4)12(2)3)15(17)18-11-14-9-7-6-8-10-14/h6-10,12-13H,5,11H2,1-4H3
41 atoms
S  -0.509529 1.599469 -0.134458
O  0.470527 -0.089462 1.639748
N  1.892664 0.47843 -0.040519
C  2.951941 -0.412713 0.455253
C  3.109469 -1.653541 -0.442918
C  4.254121 0.35511 0.64883
C  4.093521 -2.643321 0.175758
C  1.773542 -2.34239 -0.700649
C  2.128998 1.208245 -1.280048
C  0.719968 0.521966 0.615636
C  2.52228 2.666597 -1.093532
C  -1.933043 1.342198 0.968359
C  -2.929888 0.366519 0.419975
C  -4.111539 0.826758 -0.152928
C  -2.695728 -1.006831 0.465375
C  -5.044832 -0.063438 -0.668075
C  -3.626836 -1.896891 -0.047981
C  -4.804407 -1.428505 -0.617992
H  2.625853 -0.75944 1.436036
H  3.523203 -1.336003 -1.407753
H  4.091533 1.251659 1.247071
H  4.979176 -0.257375 1.18239
H  4.710885 0.65029 -0.297536
H  3.768497 -2.952609 1.172343
H  4.166633 -3.542045 -0.438524
H  5.100622 -2.236119 0.264549
H  1.064916 -1.698507 -1.223775
H  1.917402 -3.228317 -1.321432
H  1.305462 -2.667909 0.231105
H  2.919072 0.688841 -1.820808
H  1.249245 1.133023 -1.923617
H  2.638084 3.138484 -2.069956
H  1.768245 3.228541 -0.543483
H  3.468313 2.764017 -0.562985
H  -2.38558 2.326125 1.087048
H  -1.555045 1.03796 1.943144
H  -4.306428 1.892158 -0.194445
H  -1.782521 -1.383844 0.909143
H  -5.959542 0.3126 -1.108516
H  -3.433774 -2.961169 -0.00159
H  -5.530295 -2.124737 -1.018141
elementType: S O N C H
totalener: -1113.73848719 hartree
nucrepener: 1490.32060612 hartree
electener: -2604.05909330 hartree
oneelecener: -4481.07191727 hartree
twoeener: 1877.01282397 hartree
cpcmener: -0.01925260 hartree
kineticenergy: 1109.65107992 hartree
xcener: -91.217874314702 hartree
chargesum: -0.0000000
charge: -0.120551 -0.511673 -0.110285 0.096198 0.047854 -0.327606 -0.307285 -0.295895 -0.081666 0.291906 -0.254198 -0.066232 0.035117 -0.209265 -0.202220 -0.137562 -0.149576 -0.176018 0.078794 0.040773 0.102785 0.106846 0.093639 0.090096 0.091721 0.094718 0.083700 0.099121 0.086971 0.111258 0.101348 0.095968 0.080314 0.093412 0.135077 0.133503 0.138233 0.151173 0.156194 0.156380 0.156932
qa: -0.1206 -0.5117 -0.1103 0.0962 0.0479 -0.3276 -0.3073 -0.2959 -0.0817 0.2919 -0.2542 -0.0662 0.0351 -0.2093 -0.2022 -0.1376 -0.1496 -0.1760 0.0788 0.0408 0.1028 0.1068 0.0936 0.0901 0.0917 0.0947 0.0837 0.0991 0.0870 0.1113 0.1013 0.0960 0.0803 0.0934 0.1351 0.1335 0.1382 0.1512 0.1562 0.1564 0.1569
va: 2.3211 1.9876 3.1201 3.7837 3.8135 3.9608 3.9468 3.9286 3.8622 4.2814 3.9051 3.7618 3.6211 3.9777 3.9327 3.8799 3.9137 3.9107 1.0425 1.0220 1.0037 1.0020 0.9944 1.0006 1.0046 1.0016 1.0085 1.0069 1.0084 0.9969 1.0160 1.0081 1.0213 1.0014 1.0076 1.0329 1.0052 1.0142 0.9907 0.9925 0.9908
dispcorr: -0.019684374 hartree
energy: -1113.758171558938
dipole: 22.94477 -21.98702 0.95775 -6.33757 6.66457 0.32699 -4.30137 3.20131 -1.10005
magnitude: 1.49476 au
magnitude: 3.79938 debye
