program: Orca
programVersion: 5.0.2
elementType: S O N C C C C C C C C C C C C C C C H H H H H H H H H H H H H H H H H H H H H H H
charge: 0
multiplicity: 1
keywords: wb97x-d3
keywords: def2-TZVPP
keywords: def2/J RIJCOSX
keywords: DEFGRID2
keywords: scfconv7
keywords: smallprint printgap noloewdin
keywords: NOSOSCF
formula: C15H23NOS
InChI: InChI=1/C15H23NOS/c1-5-16(13(4)12(2)3)15(17)18-11-14-9-7-6-8-10-14/h6-10,12-13H,5,11H2,1-4H3
41 atoms
S  -0.487612 1.99064 0.092684
O  0.351993 0.11766 1.734827
N  1.736045 0.531388 -0.020111
C  2.677093 -0.524959 0.383906
C  2.539472 -1.768199 -0.516347
C  4.100268 0.014462 0.452804
C  3.441349 -2.89349 -0.016133
C  1.09648 -2.255018 -0.599923
C  1.989308 1.241796 -1.26813
C  0.626723 0.72349 0.71451
C  2.576883 2.633693 -1.096368
C  -1.993246 1.572587 1.023081
C  -2.71792 0.396292 0.440918
C  -2.702436 -0.845406 1.068024
C  -3.414828 0.532469 -0.758729
C  -3.363182 -1.929958 0.503726
C  -4.07667 -0.547154 -1.321116
C  -4.049586 -1.785767 -0.692297
H  2.391392 -0.819727 1.393683
H  2.86883 -1.503995 -1.528376
H  4.753708 -0.706789 0.942102
H  4.52202 0.220039 -0.533089
H  4.140736 0.931145 1.041553
H  3.230739 -3.13495 1.028816
H  3.279646 -3.801505 -0.59925
H  4.500364 -2.648793 -0.094425
H  0.705873 -2.522674 0.384456
H  0.426445 -1.511923 -1.034672
H  1.033358 -3.14552 -1.227979
H  2.674021 0.634216 -1.858691
H  1.06861 1.29064 -1.853174
H  3.554415 2.60287 -0.616209
H  2.702341 3.098794 -2.075199
H  1.934376 3.286285 -0.504809
H  -2.602248 2.475952 0.956471
H  -1.743102 1.42887 2.072847
H  -2.174808 -0.968873 2.00458
H  -3.438454 1.493647 -1.258537
H  -3.34039 -2.889514 1.00362
H  -4.615384 -0.423164 -2.251706
H  -4.564332 -2.630798 -1.131415
elementType: S O N C H
totalener: -1113.73846383 hartree
nucrepener: 1518.21948861 hartree
electener: -2631.95795245 hartree
oneelecener: -4537.12684357 hartree
twoeener: 1905.16889112 hartree
cpcmener: -0.01980614 hartree
kineticenergy: 1109.65292640 hartree
xcener: -91.217629870535 hartree
chargesum: 0.0000000
charge: -0.125021 -0.506792 -0.112329 0.092786 0.054801 -0.324461 -0.307841 -0.297045 -0.083605 0.288874 -0.250620 -0.049659 0.049471 -0.205807 -0.216286 -0.139950 -0.144674 -0.173578 0.078559 0.041185 0.107200 0.094031 0.102050 0.090761 0.090898 0.095845 0.083818 0.082185 0.099482 0.107110 0.104061 0.092596 0.096078 0.080561 0.144136 0.120154 0.136585 0.135418 0.156193 0.156259 0.156568
qa: -0.1250 -0.5068 -0.1123 0.0928 0.0548 -0.3245 -0.3078 -0.2970 -0.0836 0.2889 -0.2506 -0.0497 0.0495 -0.2058 -0.2163 -0.1400 -0.1447 -0.1736 0.0786 0.0412 0.1072 0.0940 0.1020 0.0908 0.0909 0.0958 0.0838 0.0822 0.0995 0.1071 0.1041 0.0926 0.0961 0.0806 0.1441 0.1202 0.1366 0.1354 0.1562 0.1563 0.1566
va: 2.3143 1.9961 3.1002 3.7883 3.8123 3.9561 3.9465 3.9302 3.8536 4.2985 3.9070 3.7901 3.5285 3.9212 3.9869 3.8828 3.8923 3.9108 1.0427 1.0230 1.0009 0.9954 1.0045 1.0003 1.0050 1.0004 1.0101 1.0065 1.0075 0.9993 1.0203 1.0018 1.0082 1.0183 1.0017 1.0341 1.0207 1.0097 0.9913 0.9907 0.9905
dispcorr: -0.020616639 hartree
energy: -1113.759080472252
dipole: 20.30294 -19.46360 0.83934 -8.60880 8.71931 0.11051 -5.72388 4.45057 -1.27330
magnitude: 1.52905 au
magnitude: 3.88655 debye
