program: Orca
programVersion: 5.0.2
elementType: S O N C C C C C C C C C C C C C C C H H H H H H H H H H H H H H H H H H H H H H H
charge: 0
multiplicity: 1
keywords: wb97x-d3
keywords: def2-TZVPP
keywords: def2/J RIJCOSX
keywords: DEFGRID2
keywords: scfconv7
keywords: smallprint printgap noloewdin
keywords: NOSOSCF
formula: C15H23NOS
InChI: InChI=1/C15H23NOS/c1-5-16(13(4)12(2)3)15(17)18-11-14-9-7-6-8-10-14/h6-10,12-13H,5,11H2,1-4H3
41 atoms
S  -0.645936 0.506448 -0.06065
O  0.961285 -1.515333 -0.519638
N  2.016075 0.417988 0.02606
C  3.365708 -0.153559 -0.135024
C  3.695738 -1.187203 0.955781
C  3.630267 -0.642693 -1.55706
C  5.148793 -1.637879 0.840204
C  3.430387 -0.629948 2.350289
C  1.93763 1.839743 0.334945
C  0.933115 -0.335861 -0.214941
C  2.041261 2.725497 -0.89336
C  -1.768729 -0.874746 -0.440469
C  -3.174423 -0.375303 -0.280005
C  -3.81082 -0.451566 0.95604
C  -3.856268 0.182839 -1.357589
C  -5.111103 0.007241 1.108765
C  -5.156907 0.643087 -1.206664
C  -5.787597 0.555091 0.026892
H  4.03378 0.69659 0.030524
H  3.061571 -2.065309 0.809922
H  3.199102 -1.621234 -1.75974
H  3.229874 0.063114 -2.28605
H  4.703415 -0.709523 -1.734909
H  5.836705 -0.79016 0.899774
H  5.401969 -2.321704 1.652121
H  5.348445 -2.163912 -0.093711
H  2.387853 -0.342517 2.493645
H  3.66334 -1.377185 3.111234
H  4.051147 0.246243 2.555009
H  1.019805 2.051285 0.885573
H  2.74545 2.069728 1.030314
H  2.998954 2.594562 -1.399517
H  1.246393 2.513209 -1.608898
H  1.962667 3.774643 -0.604851
H  -1.569468 -1.697826 0.243917
H  -1.588211 -1.217201 -1.458582
H  -3.285796 -0.878771 1.802464
H  -3.367825 0.251012 -2.322714
H  -5.597576 -0.065428 2.073099
H  -5.679507 1.066687 -2.054809
H  -6.804038 0.908515 0.144119
elementType: S O N C H
totalener: -1113.73814899 hartree
nucrepener: 1460.41557487 hartree
electener: -2574.15372386 hartree
oneelecener: -4421.20936434 hartree
twoeener: 1847.05564048 hartree
cpcmener: -0.02008368 hartree
kineticenergy: 1109.64907217 hartree
xcener: -91.213383784058 hartree
chargesum: 0.0000000
charge: -0.126567 -0.514301 -0.111477 0.057343 0.069061 -0.317059 -0.304611 -0.312753 -0.051796 0.308874 -0.256445 -0.051249 0.015613 -0.192025 -0.189374 -0.148741 -0.150085 -0.163127 0.086312 0.048623 0.098115 0.100679 0.103405 0.086785 0.091565 0.096561 0.090574 0.097709 0.083669 0.099076 0.097221 0.090001 0.079500 0.098663 0.117640 0.118923 0.141339 0.140870 0.156759 0.156821 0.157910
qa: -0.1266 -0.5143 -0.1115 0.0573 0.0691 -0.3171 -0.3046 -0.3128 -0.0518 0.3089 -0.2564 -0.0512 0.0156 -0.1920 -0.1894 -0.1487 -0.1501 -0.1631 0.0863 0.0486 0.0981 0.1007 0.1034 0.0868 0.0916 0.0966 0.0906 0.0977 0.0837 0.0991 0.0972 0.0900 0.0795 0.0987 0.1176 0.1189 0.1413 0.1409 0.1568 0.1568 0.1579
va: 2.3574 1.9927 3.1345 3.8151 3.7721 3.9367 3.9416 3.9346 3.8722 4.2772 3.9292 3.8833 3.6268 3.9518 3.9489 3.8940 3.8948 3.8983 0.9990 1.0387 1.0146 1.0034 0.9976 1.0004 1.0052 1.0009 1.0076 1.0068 1.0026 1.0092 0.9976 1.0009 1.0138 1.0089 1.0131 1.0123 1.0051 1.0053 0.9912 0.9912 0.9903
dispcorr: -0.018850573 hartree
energy: -1113.756999565287
dipole: 25.67531 -25.03066 0.64465 1.31065 -0.11728 1.19337 2.38386 -2.09974 0.28413
magnitude: 1.38580 au
magnitude: 3.52242 debye
