program: Orca
programVersion: 5.0.2
elementType: S O N C C C C C C C C C C C C C C C H H H H H H H H H H H H H H H H H H H H H H H
charge: 0
multiplicity: 1
keywords: wb97x-d3
keywords: def2-TZVPP
keywords: def2/J RIJCOSX
keywords: DEFGRID2
keywords: scfconv7
keywords: smallprint printgap noloewdin
keywords: NOSOSCF
formula: C15H23NOS
InChI: InChI=1/C15H23NOS/c1-5-16(13(4)12(2)3)15(17)18-11-14-9-7-6-8-10-14/h6-10,12-13H,5,11H2,1-4H3
41 atoms
S  -0.453497 2.068784 0.08795
O  0.308618 0.201404 1.765725
N  1.722193 0.520655 0.011878
C  2.565553 -0.620218 0.405426
C  2.24601 -1.902833 -0.391698
C  4.046572 -0.267221 0.400956
C  0.791358 -2.335984 -0.234777
C  2.615823 -1.861119 -1.871444
C  2.094108 1.332729 -1.141333
C  0.61812 0.776312 0.738587
C  2.745904 2.658886 -0.781586
C  -1.987646 1.651464 0.971403
C  -2.588393 0.358086 0.505682
C  -3.068507 0.232055 -0.797339
C  -2.661894 -0.74146 1.354656
C  -3.598327 -0.968443 -1.24351
C  -3.188657 -1.947249 0.908202
C  -3.65437 -2.066204 -0.392667
H  2.309749 -0.837925 1.441757
H  2.869595 -2.67303 0.077001
H  4.618349 -1.130813 0.743551
H  4.436029 0.006328 -0.579475
H  4.254019 0.553612 1.087872
H  0.104043 -1.624158 -0.697861
H  0.629394 -3.298094 -0.724903
H  0.50566 -2.452893 0.811043
H  1.955095 -1.204618 -2.440695
H  3.644148 -1.538863 -2.042678
H  2.51942 -2.858121 -2.305613
H  2.781568 0.754289 -1.75236
H  1.216619 1.495354 -1.771106
H  2.983875 3.2089 -1.69318
H  2.096378 3.292238 -0.176643
H  3.674506 2.50996 -0.231047
H  -2.647562 2.492922 0.749844
H  -1.809014 1.657069 2.045367
H  -3.020981 1.078873 -1.472479
H  -2.303448 -0.658618 2.372725
H  -3.966971 -1.049038 -2.258308
H  -3.232878 -2.794424 1.580924
H  -4.062486 -3.005891 -0.742472
elementType: S O N C H
totalener: -1113.73523732 hartree
nucrepener: 1542.23600630 hartree
electener: -2655.97124362 hartree
oneelecener: -4585.31078475 hartree
twoeener: 1929.33954112 hartree
cpcmener: -0.01984784 hartree
kineticenergy: 1109.64279271 hartree
xcener: -91.217126502568 hartree
chargesum: -0.0000000
charge: -0.126036 -0.498073 -0.111975 0.104953 0.068595 -0.314798 -0.310017 -0.331988 -0.103454 0.288055 -0.252378 -0.048924 0.046546 -0.210568 -0.192965 -0.145322 -0.149345 -0.169692 0.084374 0.041481 0.105223 0.089012 0.104371 0.065968 0.101130 0.092834 0.084639 0.100123 0.100602 0.117379 0.106906 0.095689 0.080208 0.093219 0.144099 0.117132 0.131819 0.133133 0.156193 0.155502 0.156350
qa: -0.1260 -0.4981 -0.1120 0.1050 0.0686 -0.3148 -0.3100 -0.3320 -0.1035 0.2881 -0.2524 -0.0489 0.0465 -0.2106 -0.1930 -0.1453 -0.1493 -0.1697 0.0844 0.0415 0.1052 0.0890 0.1044 0.0660 0.1011 0.0928 0.0846 0.1001 0.1006 0.1174 0.1069 0.0957 0.0802 0.0932 0.1441 0.1171 0.1318 0.1331 0.1562 0.1555 0.1563
va: 2.3119 2.0096 3.1277 3.7799 3.8398 3.9481 3.9395 3.9522 3.8709 4.2931 3.9177 3.8157 3.5132 3.9692 3.9121 3.8946 3.8798 3.9051 1.0311 1.0180 1.0044 0.9975 1.0022 1.0040 1.0070 1.0114 0.9941 0.9984 1.0073 0.9871 1.0170 1.0085 1.0179 1.0014 1.0015 1.0323 1.0142 1.0192 0.9908 0.9916 0.9905
dispcorr: -0.021930134 hartree
energy: -1113.757167453144
dipole: 18.54338 -17.64226 0.90112 -7.64965 7.67564 0.02599 -7.81475 6.63811 -1.17664
magnitude: 1.48229 au
magnitude: 3.76767 debye
