program: Orca
programVersion: 5.0.2
elementType: S O N C C C C C C C C C C C C C C C H H H H H H H H H H H H H H H H H H H H H H H
charge: 0
multiplicity: 1
keywords: wb97x-d3
keywords: def2-TZVPP
keywords: def2/J RIJCOSX
keywords: DEFGRID2
keywords: scfconv7
keywords: smallprint printgap noloewdin
keywords: NOSOSCF
formula: C15H23NOS
InChI: InChI=1/C15H23NOS/c1-5-16(13(4)12(2)3)15(17)18-11-14-9-7-6-8-10-14/h6-10,12-13H,5,11H2,1-4H3
41 atoms
S  -0.451463 1.946151 0.493909
O  0.394769 -0.211168 1.74985
N  1.798317 0.568744 0.140796
C  2.832825 -0.41775 0.473819
C  2.934878 -1.532568 -0.580295
C  4.16791 0.272526 0.749986
C  4.01642 -2.540471 -0.1956
C  1.60226 -2.251441 -0.766576
C  2.012357 1.472131 -0.980205
C  0.663864 0.5833 0.878052
C  1.306967 1.071833 -2.269011
C  -1.939377 1.369436 1.368155
C  -2.745483 0.410248 0.545861
C  -3.635604 0.88655 -0.41285
C  -2.607212 -0.964917 0.707708
C  -4.373174 0.011963 -1.193931
C  -3.343879 -1.841814 -0.075318
C  -4.227862 -1.358187 -1.027726
H  2.505206 -0.881057 1.405078
H  3.228536 -1.080386 -1.536446
H  4.828631 -0.387896 1.309061
H  4.697829 0.558441 -0.160701
H  4.019496 1.167423 1.353845
H  4.023907 -3.378951 -0.892693
H  5.016191 -2.107218 -0.201967
H  3.834977 -2.948945 0.801485
H  1.284463 -2.7291 0.161843
H  0.801545 -1.581406 -1.076896
H  1.689831 -3.02896 -1.526816
H  1.725475 2.487747 -0.696887
H  3.086139 1.524836 -1.157001
H  1.669983 0.117276 -2.647584
H  0.230051 0.996776 -2.128163
H  1.490332 1.824359 -3.036787
H  -2.503936 2.279275 1.57667
H  -1.632962 0.941906 2.320934
H  -3.7505 1.955553 -0.550786
H  -1.914128 -1.348116 1.444201
H  -5.062891 0.399629 -1.932264
H  -3.225089 -2.908867 0.061303
H  -4.802716 -2.044194 -1.636049
totalener: -1113.71940408 hartree
nucrepener: 1516.36245427 hartree
electener: -2630.08185835 hartree
oneelecener: -4532.69731581 hartree
twoeener: 1902.61545746 hartree
kineticenergy: 1109.68144522 hartree
xcener: -91.219922710890 hartree
chargesum: -0.0000000
charge: -0.115588 -0.424653 -0.125122 0.085092 0.007716 -0.315035 -0.283100 -0.259761 -0.096084 0.282180 -0.248280 -0.100453 0.051532 -0.188352 -0.162172 -0.111392 -0.113015 -0.138698 0.089644 0.033004 0.095702 0.078147 0.107806 0.084694 0.087829 0.089130 0.092968 0.081943 0.088771 0.099530 0.099630 0.080434 0.095421 0.088292 0.126620 0.129910 0.103702 0.133801 0.121962 0.123571 0.122672
qa: -0.1156 -0.4247 -0.1251 0.0851 0.0077 -0.3150 -0.2831 -0.2598 -0.0961 0.2822 -0.2483 -0.1005 0.0515 -0.1884 -0.1622 -0.1114 -0.1130 -0.1387 0.0896 0.0330 0.0957 0.0781 0.1078 0.0847 0.0878 0.0891 0.0930 0.0819 0.0888 0.0995 0.0996 0.0804 0.0954 0.0883 0.1266 0.1299 0.1037 0.1338 0.1220 0.1236 0.1227
va: 2.3108 2.0739 3.0959 3.7774 3.8740 3.9554 3.9456 3.9338 3.9191 4.2754 3.9037 3.8352 3.6195 4.0352 3.9677 3.9525 3.9473 3.9681 1.0409 1.0131 1.0016 0.9992 1.0097 1.0090 1.0020 1.0030 1.0098 1.0083 1.0061 1.0039 0.9945 1.0007 1.0178 1.0152 1.0045 1.0319 1.0140 1.0216 1.0004 1.0010 1.0001
dispcorr: -0.020682571 hartree
energy: -1113.740086655826
dipole: 20.08741 -19.45458 0.63282 -9.49574 9.65265 0.15690 -8.48773 7.75525 -0.73249
magnitude: 0.98062 au
magnitude: 2.49255 debye
