program: Orca
programVersion: 5.0.2
elementType: S O N C C C C C C C C C C C C C C C H H H H H H H H H H H H H H H H H H H H H H H
charge: 0
multiplicity: 1
keywords: wb97x-d3
keywords: def2-TZVPP
keywords: def2/J RIJCOSX
keywords: DEFGRID2
keywords: scfconv7
keywords: smallprint printgap noloewdin
keywords: NOSOSCF
formula: C15H23NOS
InChI: InChI=1/C15H23NOS/c1-5-16(13(4)12(2)3)15(17)18-11-14-9-7-6-8-10-14/h6-10,12-13H,5,11H2,1-4H3
41 atoms
S  -0.444726 1.905279 0.527873
O  0.3994 -0.283651 1.729288
N  1.810005 0.547053 0.151486
C  2.850385 -0.439766 0.464266
C  2.978089 -1.512858 -0.630086
C  4.172527 0.254419 0.787524
C  4.074574 -2.517392 -0.282241
C  1.658257 -2.245315 -0.850648
C  2.025116 1.479792 -0.945089
C  0.669356 0.535072 0.88047
C  1.325199 1.110912 -2.246193
C  -1.929472 1.327965 1.405261
C  -2.765633 0.408724 0.567343
C  -2.642233 -0.972988 0.676748
C  -3.671201 0.929865 -0.352744
C  -3.40908 -1.81186 -0.118847
C  -4.43829 0.093099 -1.146959
C  -4.308069 -1.283746 -1.032884
H  2.51443 -0.940747 1.372807
H  3.268782 -1.020634 -1.567139
H  4.700497 0.603678 -0.102079
H  4.00703 1.108925 1.443166
H  4.842737 -0.427445 1.308118
H  4.103743 -3.320846 -1.018981
H  5.066176 -2.066416 -0.258781
H  3.892001 -2.976784 0.692244
H  0.849361 -1.577273 -1.143384
H  1.762147 -2.995974 -1.635432
H  1.342266 -2.757763 0.059644
H  1.735109 2.487269 -0.63681
H  3.09927 1.539271 -1.117445
H  1.511747 1.882414 -2.994138
H  1.690837 0.166365 -2.64663
H  0.24773 1.031654 -2.112535
H  -2.475298 2.240229 1.6505
H  -1.616475 0.865783 2.339643
H  -1.937143 -1.391347 1.382239
H  -3.776337 2.004385 -0.449882
H  -3.302808 -2.884581 -0.021778
H  -5.13953 0.51617 -1.854386
H  -4.906421 -1.940253 -1.650994
totalener: -1113.71950934 hartree
nucrepener: 1513.24741365 hartree
electener: -2626.96692299 hartree
oneelecener: -4526.45852413 hartree
twoeener: 1899.49160114 hartree
kineticenergy: 1109.68214576 hartree
xcener: -91.220158748040 hartree
chargesum: -0.0000000
charge: -0.114606 -0.424950 -0.125395 0.083150 0.007468 -0.313058 -0.282887 -0.260722 -0.095502 0.282869 -0.249527 -0.101860 0.051957 -0.162332 -0.188808 -0.112195 -0.111345 -0.139205 0.089527 0.032812 0.078281 0.107509 0.095152 0.084725 0.087779 0.089265 0.083066 0.088736 0.093005 0.099622 0.099204 0.088171 0.080868 0.095907 0.126881 0.130253 0.134241 0.103650 0.123454 0.122429 0.122411
qa: -0.1146 -0.4250 -0.1254 0.0832 0.0075 -0.3131 -0.2829 -0.2607 -0.0955 0.2829 -0.2495 -0.1019 0.0520 -0.1623 -0.1888 -0.1122 -0.1113 -0.1392 0.0895 0.0328 0.0783 0.1075 0.0952 0.0847 0.0878 0.0893 0.0831 0.0887 0.0930 0.0996 0.0992 0.0882 0.0809 0.0959 0.1269 0.1303 0.1342 0.1037 0.1235 0.1224 0.1224
va: 2.3123 2.0734 3.0946 3.7841 3.8724 3.9547 3.9450 3.9334 3.9156 4.2746 3.9040 3.8333 3.6208 3.9688 4.0375 3.9471 3.9528 3.9685 1.0410 1.0133 1.0000 1.0097 1.0017 1.0090 1.0018 1.0030 1.0083 1.0058 1.0099 1.0045 0.9951 1.0152 1.0005 1.0181 1.0046 1.0318 1.0213 1.0139 1.0010 1.0003 1.0002
dispcorr: -0.020535295 hartree
energy: -1113.740044634277
dipole: 20.32909 -19.69508 0.63401 -9.17874 9.36697 0.18823 -8.70229 7.98389 -0.71840
magnitude: 0.97647 au
magnitude: 2.48199 debye
