program: Orca
programVersion: 5.0.2
elementType: S O N C C C C C C C C C C C C C C C H H H H H H H H H H H H H H H H H H H H H H H
charge: 0
multiplicity: 1
keywords: wb97x-d3
keywords: def2-TZVPP
keywords: def2/J RIJCOSX
keywords: DEFGRID2
keywords: scfconv7
keywords: smallprint printgap noloewdin
keywords: NOSOSCF
formula: C15H23NOS
InChI: InChI=1/C15H23NOS/c1-5-16(13(4)12(2)3)15(17)18-11-14-9-7-6-8-10-14/h6-10,12-13H,5,11H2,1-4H3
41 atoms
S  -0.499547 1.87517 0.027189
O  0.398442 0.039387 1.689816
N  1.789821 0.519894 -0.042087
C  2.759371 -0.498373 0.374949
C  2.719047 -1.729369 -0.55128
C  4.152943 0.105367 0.515328
C  3.620697 -2.839011 -0.013569
C  1.297687 -2.25578 -0.728269
C  2.035911 1.257177 -1.270701
C  0.654057 0.657751 0.681526
C  2.568527 2.669793 -1.067535
C  -1.961087 1.487473 1.037246
C  -2.781398 0.37454 0.458802
C  -2.631412 -0.934789 0.90503
C  -3.701998 0.637549 -0.551637
C  -3.385887 -1.95754 0.34851
C  -4.456198 -0.382651 -1.107821
C  -4.298869 -1.686241 -0.659113
H  2.438981 -0.825685 1.364479
H  3.104222 -1.440974 -1.537945
H  4.593275 0.373096 -0.44753
H  4.12254 0.999277 1.137604
H  4.830132 -0.598574 0.995997
H  3.330783 -3.122295 1.001079
H  3.540676 -3.73139 -0.634869
H  4.672785 -2.556433 0.005878
H  0.854823 -2.526883 0.231601
H  0.636151 -1.529359 -1.199702
H  1.298303 -3.147256 -1.356815
H  2.750187 0.682045 -1.860619
H  1.12242 1.284853 -1.869426
H  3.531716 2.665716 -0.559497
H  2.70192 3.157557 -2.033619
H  1.881652 3.279956 -0.482611
H  -2.528904 2.418356 1.065532
H  -1.626555 1.271056 2.050202
H  -1.915349 -1.153138 1.685672
H  -3.828874 1.653026 -0.908973
H  -3.259583 -2.971202 0.706038
H  -5.169416 -0.159811 -1.890691
H  -4.888035 -2.484771 -1.0907
totalener: -1113.72039708 hartree
nucrepener: 1509.76445833 hartree
electener: -2623.48485541 hartree
oneelecener: -4519.49594541 hartree
twoeener: 1896.01109000 hartree
kineticenergy: 1109.68226061 hartree
xcener: -91.219960618330 hartree
chargesum: -0.0000000
charge: -0.110701 -0.426345 -0.126285 0.082701 0.026531 -0.311059 -0.284877 -0.262717 -0.112784 0.285163 -0.227868 -0.104051 0.061050 -0.168203 -0.186980 -0.111515 -0.113985 -0.139162 0.085003 0.030047 0.081817 0.101344 0.098606 0.088304 0.084309 0.086613 0.090001 0.081526 0.087749 0.094288 0.104944 0.082545 0.084983 0.085481 0.127301 0.130300 0.132350 0.104415 0.123663 0.121913 0.123588
qa: -0.1107 -0.4263 -0.1263 0.0827 0.0265 -0.3111 -0.2849 -0.2627 -0.1128 0.2852 -0.2279 -0.1041 0.0610 -0.1682 -0.1870 -0.1115 -0.1140 -0.1392 0.0850 0.0300 0.0818 0.1013 0.0986 0.0883 0.0843 0.0866 0.0900 0.0815 0.0877 0.0943 0.1049 0.0825 0.0850 0.0855 0.1273 0.1303 0.1323 0.1044 0.1237 0.1219 0.1236
va: 2.3105 2.0739 3.0702 3.7985 3.8512 3.9575 3.9490 3.9341 3.8882 4.2810 3.9062 3.8296 3.6140 3.9698 4.0427 3.9425 3.9544 3.9683 1.0428 1.0205 0.9954 1.0063 1.0073 1.0030 1.0083 1.0041 1.0111 1.0122 1.0087 0.9988 1.0206 1.0046 1.0114 1.0234 1.0040 1.0320 1.0226 1.0134 1.0009 1.0004 0.9998
dispcorr: -0.020285248 hartree
energy: -1113.740682328493
dipole: 21.10715 -20.47683 0.63032 -7.85349 7.89705 0.04357 -5.42624 4.68571 -0.74053
magnitude: 0.97344 au
magnitude: 2.47430 debye
