program: Orca
programVersion: 5.0.2
elementType: S O N C C C C C C C C C H H H H H H H H H H H H H H H H H H H
charge: 0
multiplicity: 1
keywords: wb97x-d3
keywords: def2-TZVPP
keywords: def2/J RIJCOSX
keywords: DEFGRID2
keywords: scfconv7
keywords: smallprint printgap noloewdin
keywords: NOSOSCF
formula: C9H19NOS
InChI: InChI=1/C9H19NOS/c1-4-7-10(8-5-2)9(11)12-6-3/h4-8H2,1-3H3
31 atoms
S  -1.602505 -0.591767 -0.493229
O  -0.825051 1.705103 0.538969
N  0.662473 0.001149 0.751692
C  1.652962 0.840281 1.420569
C  1.051984 -1.366272 0.434895
C  2.807196 1.286147 0.532596
C  1.57531 -1.590577 -0.980123
C  -0.500215 0.541958 0.349222
C  2.380254 2.08853 -0.685698
C  1.879031 -3.061918 -1.211078
C  -3.101713 0.41789 -0.622875
C  -3.908007 0.468635 0.658593
H  2.042849 0.269756 2.265815
H  1.148589 1.70967 1.837176
H  0.211164 -2.037159 0.631439
H  1.822996 -1.647344 1.153882
H  3.471412 1.888839 1.157187
H  3.395876 0.419398 0.222457
H  0.84217 -1.247186 -1.712776
H  2.477278 -0.99706 -1.139363
H  1.740469 1.507985 -1.352518
H  1.833594 2.988695 -0.400879
H  3.249149 2.401288 -1.265571
H  2.630828 -3.428713 -0.510015
H  0.984948 -3.675447 -1.086571
H  2.258298 -3.23216 -2.218546
H  -2.833095 1.41114 -0.978813
H  -3.674694 -0.058989 -1.419129
H  -4.214568 -0.528715 0.971805
H  -3.345218 0.923021 1.472579
H  -4.810112 1.062778 0.504335
elementType: S O N C H
totalener: -882.66731474 hartree
nucrepener: 881.59794567 hartree
electener: -1764.26526041 hartree
oneelecener: -2957.37076683 hartree
twoeener: 1193.10550641 hartree
cpcmener: -0.02018478 hartree
kineticenergy: 879.65651729 hartree
xcener: -67.804726791002 hartree
chargesum: 0.0000000
charge: -0.115287 -0.555071 -0.110948 -0.058983 -0.093697 -0.107419 -0.082685 0.306463 -0.281015 -0.277972 -0.070730 -0.260687 0.103365 0.099309 0.108192 0.110053 0.078549 0.074982 0.061633 0.074182 0.077748 0.088038 0.098432 0.083692 0.084082 0.093691 0.092323 0.113154 0.084519 0.086572 0.095517
qa: -0.1153 -0.5551 -0.1109 -0.0590 -0.0937 -0.1074 -0.0827 0.3065 -0.2810 -0.2780 -0.0707 -0.2607 0.1034 0.0993 0.1082 0.1101 0.0785 0.0750 0.0616 0.0742 0.0777 0.0880 0.0984 0.0837 0.0841 0.0937 0.0923 0.1132 0.0845 0.0866 0.0955
va: 2.3520 1.9353 3.1579 3.8514 3.8526 3.8535 3.8147 4.2598 3.9294 3.9614 3.8910 3.9284 1.0063 1.0247 1.0114 0.9977 1.0134 1.0028 1.0332 1.0098 0.9999 1.0056 1.0052 1.0012 1.0011 1.0026 1.0311 1.0058 1.0071 1.0126 1.0041
dispcorr: -0.013002182 hartree
energy: -882.680316920038
dipole: 8.69031 -7.81191 0.87840 -2.23126 1.02082 -1.21044 -1.74529 1.76960 0.02431
magnitude: 1.49577 au
magnitude: 3.80195 debye
