program: Orca
programVersion: 5.0.2
elementType: S O N C C C C C C C C C H H H H H H H H H H H H H H H H H H H
charge: 0
multiplicity: 1
keywords: wb97x-d3
keywords: def2-TZVPP
keywords: def2/J RIJCOSX
keywords: DEFGRID2
keywords: scfconv7
keywords: smallprint printgap noloewdin
keywords: NOSOSCF
formula: C9H19NOS
InChI: InChI=1/C9H19NOS/c1-4-7-10(8-5-2)9(11)12-6-3/h4-8H2,1-3H3
31 atoms
S  -1.547435 0.982004 0.501968
O  -1.096228 -1.169978 -0.943875
N  0.744677 -0.258097 0.012924
C  1.353532 0.740823 0.883182
C  1.605107 -1.311504 -0.517032
C  1.706147 2.052097 0.193255
C  1.666308 -2.541319 0.378404
C  -0.570739 -0.311416 -0.248591
C  2.718101 1.910701 -0.932607
C  2.575501 -3.610536 -0.205523
C  -3.20271 0.557621 -0.112397
C  -4.188624 1.565033 0.451052
H  2.256988 0.291311 1.299085
H  0.703903 0.929509 1.740925
H  2.604412 -0.891138 -0.631353
H  1.270902 -1.584207 -1.518387
H  0.798155 2.529689 -0.181327
H  2.105323 2.71815 0.962312
H  2.026808 -2.247415 1.368038
H  0.660534 -2.944481 0.517705
H  2.334726 1.304147 -1.754009
H  2.970986 2.887457 -1.346281
H  3.644759 1.451776 -0.583207
H  2.212856 -3.953546 -1.175992
H  3.591542 -3.237447 -0.345834
H  2.63216 -4.479767 0.449726
H  -3.201352 0.588772 -1.200851
H  -3.460489 -0.451417 0.204901
H  -4.217288 1.538164 1.540253
H  -3.952522 2.582794 0.140742
H  -5.189296 1.332558 0.087224
elementType: S O N C H
totalener: -882.66666496 hartree
nucrepener: 863.08893329 hartree
electener: -1745.75559824 hartree
oneelecener: -2920.27091134 hartree
twoeener: 1174.51531310 hartree
cpcmener: -0.02092409 hartree
kineticenergy: 879.64971776 hartree
xcener: -67.801860453680 hartree
chargesum: 0.0000000
charge: -0.117517 -0.561648 -0.122349 -0.081459 -0.062212 -0.090663 -0.077338 0.331578 -0.279161 -0.275526 -0.082256 -0.263540 0.112925 0.105001 0.111322 0.094250 0.059929 0.070577 0.063978 0.063970 0.081017 0.097700 0.087289 0.082815 0.081756 0.092338 0.097906 0.097123 0.092148 0.091703 0.098345
qa: -0.1175 -0.5616 -0.1223 -0.0815 -0.0622 -0.0907 -0.0773 0.3316 -0.2792 -0.2755 -0.0823 -0.2635 0.1129 0.1050 0.1113 0.0942 0.0599 0.0706 0.0640 0.0640 0.0810 0.0977 0.0873 0.0828 0.0818 0.0923 0.0979 0.0971 0.0921 0.0917 0.0983
va: 2.3730 1.9342 3.1500 3.8726 3.8303 3.8576 3.8667 4.2581 3.9251 3.9440 3.9489 3.9410 0.9954 1.0137 0.9920 1.0198 1.0257 1.0151 1.0131 1.0189 1.0018 1.0065 0.9979 1.0006 1.0012 1.0031 1.0107 1.0106 1.0051 1.0053 1.0018
dispcorr: -0.011761497 hartree
energy: -882.678426452651
dipole: 9.48907 -8.46283 1.02624 -1.21496 1.98455 0.76959 -0.37372 1.15443 0.78071
magnitude: 1.50165 au
magnitude: 3.81689 debye
