program: Orca
programVersion: 5.0.2
elementType: S O N C C C C C C C C C H H H H H H H H H H H H H H H H H H H
charge: 0
multiplicity: 1
keywords: wb97x-d3
keywords: def2-TZVPP
keywords: def2/J RIJCOSX
keywords: DEFGRID2
keywords: scfconv7
keywords: smallprint printgap noloewdin
keywords: NOSOSCF
formula: C9H19NOS
InChI: InChI=1/C9H19NOS/c1-4-7-10(8-5-2)9(11)12-6-3/h4-8H2,1-3H3
31 atoms
S  -1.365835 1.445837 0.068431
O  -1.274134 -1.168293 -0.238205
N  0.594291 -0.266938 0.655108
C  1.378798 0.871698 1.111987
C  1.25216 -1.571759 0.659453
C  2.497377 1.290743 0.16795
C  1.76423 -2.037701 -0.698375
C  -0.645467 -0.19179 0.145689
C  2.025784 1.728378 -1.207928
C  2.411829 -3.409482 -0.592603
C  -3.036043 1.053093 -0.518138
C  -3.964379 0.54359 0.565243
H  1.806278 0.604763 2.080875
H  0.719063 1.717555 1.306637
H  0.569269 -2.316336 1.074104
H  2.086815 -1.499586 1.35863
H  3.028354 2.112166 0.655381
H  3.224603 0.479877 0.075938
H  0.943552 -2.074913 -1.416765
H  2.487806 -1.318355 -1.087784
H  1.351857 2.583602 -1.145025
H  2.872565 2.019798 -1.830387
H  1.497443 0.930239 -1.73213
H  1.70451 -4.157067 -0.229053
H  2.777235 -3.747442 -1.562401
H  3.261432 -3.398653 0.092607
H  -3.401138 1.998552 -0.922361
H  -2.963879 0.36009 -1.354986
H  -3.608697 -0.38852 1.00147
H  -4.07451 1.273253 1.366788
H  -4.954026 0.357395 0.144617
elementType: S O N C H
totalener: -882.66741745 hartree
nucrepener: 878.68348875 hartree
electener: -1761.35090620 hartree
oneelecener: -2951.57252881 hartree
twoeener: 1190.22162261 hartree
cpcmener: -0.02004453 hartree
kineticenergy: 879.64802008 hartree
xcener: -67.802981658919 hartree
chargesum: 0.0000000
charge: -0.121658 -0.559575 -0.119727 -0.080265 -0.060875 -0.086260 -0.090785 0.316151 -0.291842 -0.277584 -0.065390 -0.264612 0.105194 0.106199 0.099272 0.105929 0.077906 0.073591 0.071304 0.066116 0.085891 0.100146 0.079595 0.083749 0.092599 0.082442 0.112974 0.092462 0.086472 0.084400 0.096180
qa: -0.1217 -0.5596 -0.1197 -0.0803 -0.0609 -0.0863 -0.0908 0.3162 -0.2918 -0.2776 -0.0654 -0.2646 0.1052 0.1062 0.0993 0.1059 0.0779 0.0736 0.0713 0.0661 0.0859 0.1001 0.0796 0.0837 0.0926 0.0824 0.1130 0.0925 0.0865 0.0844 0.0962
va: 2.3506 1.9317 3.1731 3.8910 3.8267 3.8233 3.8381 4.2493 3.9387 3.9566 3.8834 3.9292 1.0056 1.0136 1.0156 1.0005 1.0141 1.0028 1.0213 1.0086 1.0045 1.0056 1.0008 1.0010 1.0023 1.0009 1.0060 1.0307 1.0138 1.0071 1.0037
dispcorr: -0.013016426 hartree
energy: -882.680433873788
dipole: 8.98227 -7.79591 1.18636 -4.12834 4.89809 0.76975 -2.08981 2.58884 0.49903
magnitude: 1.49967 au
magnitude: 3.81185 debye
