program: Orca
programVersion: 5.0.2
elementType: S O N C C C C C C C C C H H H H H H H H H H H H H H H H H H H
charge: 0
multiplicity: 1
keywords: wb97x-d3
keywords: def2-TZVPP
keywords: def2/J RIJCOSX
keywords: DEFGRID2
keywords: scfconv7
keywords: smallprint printgap noloewdin
keywords: NOSOSCF
formula: C9H19NOS
InChI: InChI=1/C9H19NOS/c1-4-7-10(8-5-2)9(11)12-6-3/h4-8H2,1-3H3
31 atoms
S  -1.716148 -0.391424 -0.837534
O  -0.893158 1.47048 0.842546
N  0.733937 0.110083 0.052315
C  1.770945 0.804014 0.806555
C  1.157952 -1.011903 -0.769655
C  2.390271 1.960734 0.034513
C  1.131278 -2.344204 -0.032862
C  -0.536941 0.533263 0.149895
C  3.51396 2.623695 0.815074
C  1.596802 -3.484523 -0.923736
C  -3.266181 0.394186 -0.320486
C  -3.783535 -0.101855 1.014125
H  2.53874 0.068332 1.055842
H  1.361452 1.154602 1.75406
H  2.172625 -0.798316 -1.113249
H  0.554262 -1.064868 -1.678658
H  2.772728 1.593654 -0.922298
H  1.61604 2.695921 -0.198734
H  1.76908 -2.279085 0.853011
H  0.117793 -2.540807 0.325291
H  3.962258 3.437313 0.243938
H  3.154031 3.04363 1.756234
H  4.309031 1.914148 1.052849
H  0.95692 -3.590102 -1.801984
H  2.6177 -3.326536 -1.276841
H  1.578428 -4.434773 -0.389526
H  -3.135818 1.475479 -0.331587
H  -3.968357 0.15098 -1.119455
H  -3.961834 -1.176916 0.995131
H  -3.088004 0.113438 1.823925
H  -4.729666 0.389236 1.250141
elementType: S O N C H
totalener: -882.67742575 hartree
nucrepener: 861.03117198 hartree
electener: -1743.70859773 hartree
oneelecener: -2916.09295861 hartree
twoeener: 1172.38436088 hartree
cpcmener: -0.01589172 hartree
kineticenergy: 879.64246181 hartree
xcener: -67.797767908921 hartree
chargesum: -0.0000000
charge: -0.130202 -0.523154 -0.120721 -0.056540 -0.093064 -0.075052 -0.065891 0.302178 -0.273071 -0.275188 -0.064342 -0.263902 0.103620 0.092519 0.112654 0.101875 0.060674 0.064491 0.067147 0.054070 0.091184 0.083178 0.080085 0.083088 0.081956 0.092208 0.093536 0.110688 0.083710 0.088105 0.094162
qa: -0.1302 -0.5232 -0.1207 -0.0565 -0.0931 -0.0751 -0.0659 0.3022 -0.2731 -0.2752 -0.0643 -0.2639 0.1036 0.0925 0.1127 0.1019 0.0607 0.0645 0.0671 0.0541 0.0912 0.0832 0.0801 0.0831 0.0820 0.0922 0.0935 0.1107 0.0837 0.0881 0.0942
va: 2.3385 1.9792 3.1806 3.8417 3.8935 3.8591 3.8371 4.2772 3.9418 3.9411 3.8899 3.9296 0.9966 1.0221 0.9943 1.0053 1.0143 1.0177 1.0142 1.0296 1.0032 1.0007 1.0019 1.0013 1.0017 1.0034 1.0308 1.0064 1.0070 1.0138 1.0043
dispcorr: -0.011653633 hartree
energy: -882.689079380513
dipole: 10.04003 -9.16701 0.87301 -3.11346 2.18414 -0.92932 2.27332 -2.75225 -0.47893
magnitude: 1.36204 au
magnitude: 3.46204 debye
