program: Gaussian 09
title: 000055940
version: EM64L-G09RevD.01
frameworkgroup: C1[X(C8H3ClF4N2)]
method: RPBEPBE
basis: SDD
operation: Freq
keyword: #p
keyword: freq=noraman
keyword: PBEPBE/SDD
title: #p freq=noraman PBEPBE/SDD
converged: NO NO NO NO
title: Mulliken charges:
elementType: Cl F F F F N N C C C C C C C C H H H
charge: 0.013848 -0.113293 -0.157802 -0.157917 -0.193492 -0.431837 0.014781 0.381734 0.174472 0.123199 -0.535444 -0.263133 0.264189 0.400841 -0.426398 0.343913 0.275815 0.286525
chargesum: 0.00000
title: Mulliken charges with hydrogens summed into heavy atoms:
elementType: Cl F F F F N N C C C C C C C C
charge: 0.013848 -0.113293 -0.157802 -0.157917 -0.193492 -0.087924 0.014781 0.381734 0.174472 0.123199 -0.259629 -0.263133 0.264189 0.400841 -0.139873
polarizability: 1.57910497e+02 -1.37328576e+00 1.28381312e+02 1.15067205e-03 -5.70640996e-04 4.95604305e+01
1716.lowfreq: -15.6372 -0.0010 0.0004 0.0011 5.7963 10.2832 15.2958 68.6430 103.7307
frequency: -14.2700 68.6188 103.7306 143.3175 170.6273 179.9122 242.3831 264.1208 298.7105 307.9548 361.1525 394.2414 408.8809 462.5913 493.3505 493.4552 545.5831 561.1116 600.6593 629.0698 630.3847 666.2199 702.1612 773.8381 803.7840 837.1963 855.7177 877.0079 921.9308 964.6175 986.2898 1036.5492 1097.2663 1117.6535 1176.3955 1229.0425 1254.8716 1299.9914 1362.8970 1389.2532 1426.3196 1486.0204 1529.3939 1584.7139 1637.3982 3187.1512 3188.2608 3584.1424
redmass: 16.3220 12.3027 17.2157 7.6393 12.7412 18.0715 5.4442 17.3514 13.6874 6.8809 15.1268 11.1765 9.9576 9.8447 13.2229 11.9220 4.7585 7.4940 2.0255 1.5516 7.4682 10.2217 10.5023 4.5493 6.8455 1.4845 1.6772 10.0913 10.5060 12.1234 3.8822 9.5448 5.6214 2.0123 1.9204 2.6117 2.7128 4.8357 5.5636 3.5575 7.7157 5.0305 5.4322 9.0534 8.3726 1.0942 1.0936 1.0822
irintensity: 0.8322 1.1932 0.8639 6.1240 0.2504 2.2734 8.3458 0.6583 5.6385 0.0683 2.4061 1.8228 1.4421 11.4329 3.1269 16.1112 3.1927 6.4400 5.1951 78.4817 2.5358 5.0653 0.9716 10.6460 24.5101 8.4476 63.2159 60.5132 50.8880 279.1080 33.6702 201.0823 151.1391 43.9171 17.2585 31.0412 329.7217 66.9598 30.1350 18.1841 11.5277 44.8710 99.7959 94.3839 81.2342 1.8370 0.6471 92.5428
temp: 298.150 k
press: 1.00000 atm
elementType: 17 9 9 9 9 7 7 6 6 6 6 6 6 6 6 1 1 1
symmnumber: 1
zpe: 265187.8 jmol-1
zpe.correction: 0.101005 hartree
zpe.thermalcorrener: 0.112415 hartree
zpe.thermalcorrenthalpy: 0.113359 hartree
zpe.thermalcorrgfe: 0.062816 hartree
zpe.sumelectzpe: -1274.523335 hartree
zpe.sumelectthermal: -1274.511925 hartree
zpe.sumelectthermalent: -1274.510981 hartree
zpe.sumelectthermalfe: -1274.561524 hartree
dipole: -1.2119 -3.9241 0.0005
dipole: 4.1070
quadrupole: -100.7071 -86.6729 -92.3066
quadrupole: -7.3708 0.0020 -0.0007
quadrupole: -7.4782 6.5560 0.9222 -7.3708 0.0020 -0.0007
hfenergy: -1274.62434 hartree
pointgroup: C01 [X(C8H3Cl1F4N2)]
dipole: -0.6324092 1.4869242 -0.0006248 debye
dipolederiv: -0.0754196 -0.0255206 -0.000028 -0.1057119 -0.7387878 -0.0000252 -0.0000309 -0.0000131 -0.0169292 -0.5706215 0.2159038 -0.0004455 0.2395249 -0.6175178 0.0005686 -0.0003519 0.0006132 -0.2570413 -0.7222172 -0.1275652 0.1631643 -0.2529479 -0.4208902 0.2266951 0.238561 0.2024736 -0.6338475 -0.7213947 -0.1276494 -0.1631193 -0.2529507 -0.4217289 -0.2272336 -0.2379849 -0.2029005 -0.6332873 -1.0140283 0.3502567 -0.000425 0.4436296 -0.4199735 0.0002248 -0.0004498 0.0001982 -0.1467372 -0.4384164 0.0594924 -0.0001005 -0.2484315 -0.5313255 -0.0000401 0.0000911 0.0002348 -0.2376379 -0.0553938 -0.127606 0.000068 0.0831556 -0.3465831 0.0000751 -0.000183 -0.0001382 -0.2023324 0.440003 0.0368506 0.0001032 0.1513239 0.1098058 0.0000427 0.0001215 -0.0000109 0.0955214 -0.0633711 -0.0047332 -0.0000677 -0.1160091 -0.3767862 -0.0000295 0.0000172 0.0000366 0.0294574 -0.6100305 -0.1892546 -0.0001486 -0.0712902 0.6346017 -0.0001666 -0.000647 -0.0002689 -0.0542453 -0.3131874 -0.0167632 -0.0000348 -0.0876895 -0.1316755 -0.0000579 -0.0000464 -0.0000295 -0.2034316 0.4799228 0.0011309 0.0002594 0.1974702 1.2742907 0.000068 0.0002797 0.0000009 -0.0476997 2.4926189 0.1039002 0.0005904 0.1684087 1.4170255 -0.0000402 0.0004617 -0.0000518 1.5717561 1.0953385 -0.2721895 0.0004614 -0.517745 0.7440717 -0.0003025 0.0005088 -0.0001753 0.1095884 -0.285611 0.125895 -0.0000806 0.3320603 -0.5131131 0.0001718 -0.0001004 0.0000493 -0.131769 0.2233654 0.0396717 -0.0000767 0.0527104 0.243757 0.0000202 -0.0001081 -0.0000252 0.3550462 0.0865057 -0.010264 -0.0000558 0.015688 0.0072514 0.0000345 -0.0000681 0.0000166 0.2134485 0.0519373 -0.0315557 -0.0000641 -0.0311961 0.0875777 -0.0000051 -0.0000702 -0.0000097 0.1901405 unknown
polarizability: 157.320975|4.3526673|128.9708052|0.0547243|-0.0047135|49.5604588 unknown
InChI: InChI=1S/C8H3ClF4N2/c9-4-1-3(10)2-5-6(4)15-7(14-5)8(11,12)13/h1-2,14H
charge 0 multiplicity 1
18 atoms
Cl -1.762148 -3.124689 -0.00072
F  3.617759 -1.120551 0.00345
F  3.489737 0.852319 -1.131605
F  3.489105 0.854589 1.133831
F  -4.197203 1.451736 -0.002112
N  0.746547 1.231974 0.000096
N  0.783005 -1.060992 0.000389
C  -0.593671 0.837461 -0.000409
C  -0.547597 -0.605181 -0.000236
C  1.51512 0.059511 0.000722
C  -1.794887 1.576218 -0.001065
C  -1.7677 -1.325017 -0.000743
C  3.007443 0.13084 0.001571
C  -2.956603 0.7938 -0.001472
C  -2.982686 -0.62508 -0.001367
H  1.104275 2.187209 0.000313
H  -1.850354 2.666974 -0.001247
H  -3.943243 -1.146021 -0.001797
