program: Orca
programVersion: 5.0.2
elementType: S O N C C C C C C C C C H H H H H H H H H H H H H H H H H H H
charge: 0
multiplicity: 1
keywords: wb97x-d3
keywords: def2-TZVPP
keywords: def2/J RIJCOSX
keywords: DEFGRID2
keywords: scfconv7
keywords: smallprint printgap noloewdin
keywords: NOSOSCF
formula: C9H19NOS
InChI: InChI=1/C9H19NOS/c1-4-7-10(8-5-2)9(11)12-6-3/h4-8H2,1-3H3
31 atoms
S  -1.316452 1.267992 0.428672
O  -1.312237 -1.348286 0.732186
N  0.740794 -0.377894 0.737919
C  1.565906 0.807168 0.552724
C  1.424628 -1.6392 1.00162
C  1.823567 1.19123 -0.900692
C  2.107779 -2.253671 -0.213621
C  -0.601936 -0.361833 0.648917
C  2.640575 2.470222 -0.989714
C  1.166025 -2.553627 -1.367965
C  -3.076351 0.852877 0.3011
C  -3.484537 0.340265 -1.064822
H  2.517458 0.609331 1.049455
H  1.127726 1.652104 1.092104
H  0.705246 -2.342577 1.416629
H  2.167174 -1.45219 1.780719
H  2.351308 0.37973 -1.406097
H  0.87507 1.324377 -1.424936
H  2.92082 -1.606345 -0.55281
H  2.584328 -3.178328 0.123269
H  3.607454 2.363412 -0.49397
H  2.833243 2.741601 -2.027899
H  2.119944 3.308217 -0.522301
H  1.704513 -3.020755 -2.193552
H  0.36857 -3.235377 -1.068117
H  0.698768 -1.648165 -1.758798
H  -3.33493 0.154339 1.094587
H  -3.58551 1.791642 0.525571
H  -2.967434 -0.582392 -1.323168
H  -4.556662 0.135037 -1.076206
H  -3.278445 1.076136 -1.841937
elementType: S O N C H
totalener: -882.67537137 hartree
nucrepener: 883.09532854 hartree
electener: -1765.77069991 hartree
oneelecener: -2960.28863375 hartree
twoeener: 1194.51793384 hartree
cpcmener: -0.01570249 hartree
kineticenergy: 879.65160202 hartree
xcener: -67.801950888830 hartree
chargesum: 0.0000000
charge: -0.123808 -0.517391 -0.113025 -0.095509 -0.064279 -0.078897 -0.105787 0.296410 -0.277375 -0.275393 -0.069231 -0.263309 0.108291 0.106912 0.099746 0.100770 0.070745 0.060838 0.071023 0.077558 0.082067 0.092836 0.083726 0.096431 0.087782 0.076347 0.095046 0.111263 0.088698 0.094265 0.083252
qa: -0.1238 -0.5174 -0.1130 -0.0955 -0.0643 -0.0789 -0.1058 0.2964 -0.2774 -0.2754 -0.0692 -0.2633 0.1083 0.1069 0.0997 0.1008 0.0707 0.0608 0.0710 0.0776 0.0821 0.0928 0.0837 0.0964 0.0878 0.0763 0.0950 0.1113 0.0887 0.0943 0.0833
va: 2.3474 1.9806 3.1491 3.8657 3.8570 3.8203 3.8549 4.2786 3.9607 3.9294 3.8939 3.9279 0.9981 1.0051 1.0255 1.0055 1.0097 1.0331 1.0032 1.0135 1.0012 1.0029 1.0016 1.0052 1.0062 1.0012 1.0298 1.0067 1.0138 1.0044 1.0070
dispcorr: -0.013097784 hartree
energy: -882.688469150552
dipole: 8.43417 -7.26761 1.16656 -1.35067 2.01500 0.66432 -8.32744 8.15242 -0.17502
magnitude: 1.35382 au
magnitude: 3.44113 debye
