program: Orca
programVersion: 5.0.2
elementType: S O N C C C C C C C C C H H H H H H H H H H H H H H H H H H H
charge: 0
multiplicity: 1
keywords: wb97x-d3
keywords: def2-TZVPP
keywords: def2/J RIJCOSX
keywords: DEFGRID2
keywords: scfconv7
keywords: smallprint printgap noloewdin
keywords: NOSOSCF
formula: C9H19NOS
InChI: InChI=1/C9H19NOS/c1-4-7-10(8-5-2)9(11)12-6-3/h4-8H2,1-3H3
31 atoms
S  -1.300731 1.21775 -0.169792
O  -1.136384 -1.053443 1.154481
N  0.814929 -0.326918 0.252725
C  1.564514 0.686127 -0.471501
C  1.576509 -1.460105 0.764555
C  2.074919 1.813176 0.417664
C  1.861254 -2.519869 -0.293522
C  -0.501247 -0.237901 0.509764
C  2.861942 2.839416 -0.380861
C  0.615011 -3.130414 -0.914371
C  -3.028242 0.866761 0.253007
C  -3.694633 -0.122876 -0.680974
H  0.962295 1.084799 -1.291325
H  2.408494 0.187285 -0.951729
H  1.039601 -1.901414 1.60233
H  2.517979 -1.076543 1.164149
H  1.231715 2.297926 0.91537
H  2.70423 1.392507 1.206688
H  2.494878 -2.098231 -1.079167
H  2.457733 -3.301546 0.184567
H  3.22846 3.641334 0.26045
H  3.727798 2.388126 -0.869384
H  2.245339 3.295854 -1.15762
H  0.028176 -2.389489 -1.459818
H  0.883486 -3.912746 -1.625513
H  -0.032817 -3.580415 -0.160534
H  -3.080838 0.54631 1.292413
H  -3.519085 1.839267 0.19543
H  -3.205809 -1.095666 -0.65602
H  -4.73582 -0.266917 -0.38606
H  -3.68686 0.236093 -1.709988
elementType: S O N C H
totalener: -882.67656803 hartree
nucrepener: 876.12023302 hartree
electener: -1758.79680105 hartree
oneelecener: -2946.34930425 hartree
twoeener: 1187.55250320 hartree
cpcmener: -0.01580358 hartree
kineticenergy: 879.65086892 hartree
xcener: -67.801056546059 hartree
chargesum: -0.0000000
charge: -0.124783 -0.516821 -0.115241 -0.096443 -0.060191 -0.066027 -0.095304 0.292969 -0.274197 -0.271192 -0.068625 -0.261194 0.101700 0.111370 0.100060 0.104831 0.056555 0.067150 0.061756 0.071079 0.092411 0.081247 0.083008 0.076448 0.095759 0.083691 0.094370 0.111170 0.087667 0.093880 0.082899
qa: -0.1248 -0.5168 -0.1152 -0.0964 -0.0602 -0.0660 -0.0953 0.2930 -0.2742 -0.2712 -0.0686 -0.2612 0.1017 0.1114 0.1001 0.1048 0.0566 0.0671 0.0618 0.0711 0.0924 0.0812 0.0830 0.0764 0.0958 0.0837 0.0944 0.1112 0.0877 0.0939 0.0829
va: 2.3454 1.9828 3.1461 3.8770 3.8542 3.8330 3.8720 4.2859 3.9437 3.9272 3.8898 3.9295 1.0140 0.9955 1.0237 1.0018 1.0305 1.0142 1.0096 1.0136 1.0034 1.0017 1.0009 1.0036 1.0057 1.0063 1.0310 1.0062 1.0127 1.0047 1.0074
dispcorr: -0.012526941 hartree
energy: -882.689094974281
dipole: 7.28986 -6.17070 1.11915 -2.56734 3.06972 0.50238 -4.45234 3.83896 -0.61338
magnitude: 1.37154 au
magnitude: 3.48618 debye
