program: Orca
programVersion: 5.0.2
elementType: S O N C C C C C C C C C H H H H H H H H H H H H H H H H H H H
charge: 0
multiplicity: 1
keywords: wb97x-d3
keywords: def2-TZVPP
keywords: def2/J RIJCOSX
keywords: DEFGRID2
keywords: scfconv7
keywords: smallprint printgap noloewdin
keywords: NOSOSCF
formula: C9H19NOS
InChI: InChI=1/C9H19NOS/c1-4-7-10(8-5-2)9(11)12-6-3/h4-8H2,1-3H3
31 atoms
S  -1.429259 1.130332 0.239981
O  -1.239379 -1.493423 0.199024
N  0.712623 -0.414669 0.598918
C  1.454935 0.828394 0.674792
C  1.427695 -1.679346 0.682872
C  1.918805 1.382221 -0.669256
C  1.831982 -2.274671 -0.661487
C  -0.616834 -0.46729 0.341329
C  2.617279 2.723993 -0.508442
C  2.529757 -3.615912 -0.486554
C  -3.130965 0.577751 -0.06025
C  -4.020397 1.802388 -0.187918
H  2.32035 0.654555 1.318815
H  0.854363 1.579425 1.196392
H  0.806332 -2.395795 1.222139
H  2.316177 -1.511141 1.296506
H  2.592865 0.667665 -1.147379
H  1.056531 1.488602 -1.330691
H  0.940637 -2.398683 -1.278325
H  2.489655 -1.582484 -1.19277
H  3.492834 2.646787 0.138741
H  2.954986 3.111089 -1.469044
H  1.949296 3.468039 -0.071669
H  1.880073 -4.336846 0.012377
H  2.813625 -4.042192 -1.448398
H  3.438721 -3.52247 0.110995
H  -3.154477 -0.021738 -0.968674
H  -3.449738 -0.055458 0.765633
H  -3.717823 2.435963 -1.02145
H  -5.050196 1.491961 -0.364353
H  -4.007323 2.407555 0.718181
totalener: -882.66062756 hartree
nucrepener: 859.58087967 hartree
electener: -1742.24150723 hartree
oneelecener: -2912.91668957 hartree
twoeener: 1170.67518234 hartree
kineticenergy: 879.66994569 hartree
xcener: -67.799470868903 hartree
chargesum: 0.0000000
charge: -0.118121 -0.414551 -0.136989 -0.112363 -0.049582 -0.074215 -0.089573 0.285577 -0.258141 -0.257829 -0.090516 -0.254200 0.087774 0.101579 0.098483 0.079457 0.063584 0.066067 0.080376 0.053828 0.072867 0.087789 0.082793 0.083927 0.086409 0.069463 0.095561 0.097904 0.087171 0.088056 0.087417
qa: -0.1181 -0.4146 -0.1370 -0.1124 -0.0496 -0.0742 -0.0896 0.2856 -0.2581 -0.2578 -0.0905 -0.2542 0.0878 0.1016 0.0985 0.0795 0.0636 0.0661 0.0804 0.0538 0.0729 0.0878 0.0828 0.0839 0.0864 0.0695 0.0956 0.0979 0.0872 0.0881 0.0874
va: 2.3574 2.0953 3.1709 3.9249 3.8696 3.8122 3.8500 4.2935 3.9562 3.9565 3.9702 3.9287 1.0050 1.0097 1.0183 1.0052 1.0144 1.0331 1.0203 1.0129 1.0028 1.0054 1.0045 1.0036 1.0051 1.0027 1.0127 1.0119 1.0068 1.0039 1.0063
dispcorr: -0.011530377 hartree
energy: -882.672157937816
dipole: 9.60819 -8.96004 0.64815 0.21591 0.27720 0.49311 -3.78750 3.76841 -0.01909
magnitude: 0.81463 au
magnitude: 2.07062 debye
