program: Orca
programVersion: 5.0.2
elementType: Cl S O O N C C C C C C C C C C C C H H H H H H H H H H H H H H H H H H
charge: 0
multiplicity: 1
keywords: wb97x-d3
keywords: def2-TZVPP
keywords: def2/J RIJCOSX
keywords: DEFGRID2
keywords: scfconv7
keywords: smallprint printgap noloewdin
keywords: NOSOSCF
formula: C12H18ClNO2S
InChI: InChI=1/C12H18ClNO2S/c1-8-7-17-10(3)12(8)14(11(15)5-13)9(2)6-16-4/h7,9H,5-6H2,1-4H3
35 atoms
Cl 0.19635 3.151597 0.101164
S  3.089343 -0.310772 -1.092817
O  -3.36836 -1.699205 -1.337623
O  -2.164557 1.063182 1.37807
N  -0.503989 -0.148506 0.436043
C  -1.447912 -1.232507 0.104663
C  0.872437 -0.284851 0.135003
C  -2.245379 -0.870881 -1.15734
C  -0.754929 -2.573797 -0.049372
C  1.822202 -0.813298 1.073068
C  1.408233 0.038437 -1.08001
C  -0.98498 0.933582 1.094164
C  3.064803 -0.87488 0.527254
C  1.493888 -1.226468 2.47297
C  0.74117 0.589793 -2.290391
C  0.004617 2.018733 1.476353
C  -4.479873 -1.33425 -0.552712
H  -2.13572 -1.308175 0.949639
H  -2.544264 0.18447 -1.132835
H  -1.611101 -1.010024 -2.036718
H  -0.216792 -2.864384 0.852869
H  -0.059125 -2.590976 -0.88944
H  -1.50978 -3.338695 -0.231834
H  3.974216 -1.2196 0.997787
H  0.470182 -0.971049 2.744666
H  1.605693 -2.303068 2.609238
H  2.153141 -0.740981 3.193297
H  0.585551 -0.183487 -3.045062
H  -0.22797 1.015796 -2.041484
H  1.336424 1.378763 -2.750425
H  -0.404674 2.583145 2.310531
H  0.991317 1.651356 1.744499
H  -4.298899 -1.425305 0.523484
H  -5.299739 -2.004795 -0.810861
H  -4.801483 -0.30572 -0.754422
elementType: Cl S O N C H
totalener: -1531.81104177 hartree
nucrepener: 1593.26055837 hartree
electener: -3125.07160014 hartree
oneelecener: -5268.90818619 hartree
twoeener: 2143.83658605 hartree
cpcmener: -0.02407831 hartree
kineticenergy: 1527.40047653 hartree
xcener: -106.024570575420 hartree
chargesum: -0.0000000
charge: -0.156265 0.056594 -0.392787 -0.496099 -0.002249 0.116597 -0.037505 -0.020772 -0.298878 -0.205548 -0.080315 0.293931 -0.084390 -0.275544 -0.291980 -0.056592 -0.109400 0.086788 0.109811 0.110111 0.112470 0.099891 0.103205 0.153497 0.101684 0.114185 0.116702 0.124687 0.096300 0.120618 0.149504 0.140885 0.089600 0.118281 0.092983
qa: -0.1563 0.0566 -0.3928 -0.4961 -0.0022 0.1166 -0.0375 -0.0208 -0.2989 -0.2055 -0.0803 0.2939 -0.0844 -0.2755 -0.2920 -0.0566 -0.1094 0.0868 0.1098 0.1101 0.1125 0.0999 0.1032 0.1535 0.1017 0.1142 0.1167 0.1247 0.0963 0.1206 0.1495 0.1409 0.0896 0.1183 0.0930
va: 1.1162 2.7798 1.9322 2.0079 2.9470 3.6476 3.6718 3.9350 3.9421 3.8122 3.9489 4.1382 3.9455 3.9271 3.9176 3.9574 3.9088 1.0145 1.0075 0.9947 0.9970 0.9981 1.0211 0.9977 1.0045 0.9927 0.9965 0.9943 1.0128 1.0029 1.0089 1.0056 0.9832 0.9913 0.9930
dispcorr: -0.021444095 hartree
energy: -1531.832485868091
dipole: -11.25282 12.58247 1.32964 -17.32191 16.43517 -0.88674 2.07157 -1.49056 0.58102
magnitude: 1.70054 au
magnitude: 4.32243 debye
