program: Orca
programVersion: 5.0.2
elementType: Cl S O O N C C C C C C C C C C C C H H H H H H H H H H H H H H H H H H
charge: 0
multiplicity: 1
keywords: wb97x-d3
keywords: def2-TZVPP
keywords: def2/J RIJCOSX
keywords: DEFGRID2
keywords: scfconv7
keywords: smallprint printgap noloewdin
keywords: NOSOSCF
formula: C12H18ClNO2S
InChI: InChI=1/C12H18ClNO2S/c1-8-7-17-10(3)12(8)14(11(15)5-13)9(2)6-16-4/h7,9H,5-6H2,1-4H3
35 atoms
Cl 1.170056 1.972961 2.318564
S  2.120057 0.133715 -1.994377
O  -1.855024 -1.41936 -1.810424
O  -2.262342 1.421574 1.706134
N  -0.860665 0.091023 0.535605
C  -1.870842 -0.991545 0.547489
C  0.354027 -0.054269 -0.179285
C  -1.635662 -2.005188 -0.55528
C  -1.941018 -1.704721 1.893101
C  1.482479 -0.798047 0.305793
C  0.546713 0.502593 -1.4135
C  -1.184895 1.249307 1.15941
C  2.504637 -0.773375 -0.588133
C  1.536318 -1.520434 1.610502
C  -0.374763 1.357089 -2.209764
C  -0.158513 2.369563 1.184689
C  -1.456004 -2.248529 -2.870825
H  -2.839029 -0.521326 0.357891
H  -0.625396 -2.432544 -0.484072
H  -2.33375 -2.838231 -0.390641
H  -1.99974 -1.002325 2.722337
H  -1.07887 -2.350154 2.057153
H  -2.834662 -2.328848 1.931853
H  3.474321 -1.238852 -0.490219
H  1.078243 -2.508643 1.537791
H  2.567746 -1.664992 1.930746
H  1.015568 -0.975349 2.396594
H  -0.515654 0.968132 -3.218958
H  -1.354877 1.418818 -1.74102
H  0.010866 2.373935 -2.307066
H  0.285051 2.585058 0.216278
H  -0.645932 3.267397 1.555997
H  -0.38241 -2.471607 -2.839847
H  -1.67128 -1.730777 -3.805596
H  -1.997016 -3.20306 -2.877928
elementType: Cl S O N C H
totalener: -1531.81180416 hartree
nucrepener: 1627.86253052 hartree
electener: -3159.67433468 hartree
oneelecener: -5338.57086752 hartree
twoeener: 2178.89653284 hartree
cpcmener: -0.02357590 hartree
kineticenergy: 1527.40427896 hartree
xcener: -106.026003069344 hartree
chargesum: 0.0000000
charge: -0.156374 0.045511 -0.361372 -0.497902 0.013123 0.121293 0.083397 -0.014112 -0.320702 -0.253795 -0.152738 0.301247 -0.078422 -0.274524 -0.276422 -0.045776 -0.123832 0.068013 0.098974 0.106735 0.102478 0.102078 0.107261 0.150699 0.108731 0.114462 0.095153 0.115186 0.104671 0.122908 0.138257 0.145183 0.088681 0.117037 0.104896
qa: -0.1564 0.0455 -0.3614 -0.4979 0.0131 0.1213 0.0834 -0.0141 -0.3207 -0.2538 -0.1527 0.3012 -0.0784 -0.2745 -0.2764 -0.0458 -0.1238 0.0680 0.0990 0.1067 0.1025 0.1021 0.1073 0.1507 0.1087 0.1145 0.0952 0.1152 0.1047 0.1229 0.1383 0.1452 0.0887 0.1170 0.1049
va: 1.1179 2.7630 1.9376 2.0063 3.0068 3.7295 3.5018 3.9809 3.9484 3.7980 3.9904 4.1239 3.9205 3.9491 3.9185 3.9506 3.9015 1.0400 0.9844 0.9996 1.0135 0.9968 1.0063 0.9992 0.9877 1.0026 1.0116 1.0001 1.0093 0.9953 1.0037 1.0139 0.9913 0.9913 0.9938
dispcorr: -0.022391390 hartree
energy: -1531.834195550651
dipole: -10.66497 11.42253 0.75756 -16.69847 15.34584 -1.35262 -6.69522 5.35772 -1.33750
magnitude: 2.04753 au
magnitude: 5.20442 debye
