program: Orca
programVersion: 5.0.2
elementType: Cl S O O N C C C C C C C C C C C C H H H H H H H H H H H H H H H H H H
charge: 0
multiplicity: 1
keywords: wb97x-d3
keywords: def2-TZVPP
keywords: def2/J RIJCOSX
keywords: DEFGRID2
keywords: scfconv7
keywords: smallprint printgap noloewdin
keywords: NOSOSCF
formula: C12H18ClNO2S
InChI: InChI=1/C12H18ClNO2S/c1-8-7-17-10(3)12(8)14(11(15)5-13)9(2)6-16-4/h7,9H,5-6H2,1-4H3
35 atoms
Cl -0.460625 3.502842 1.628364
S  2.980385 -0.463191 -1.505542
O  -2.428547 -1.238409 -1.604306
O  -1.833168 0.970471 1.668382
N  -0.434456 -0.285329 0.402956
C  -1.324251 -1.458351 0.517828
C  0.896414 -0.425335 -0.057819
C  -2.643623 -1.257105 -0.220018
C  -0.642071 -2.737974 0.055443
C  1.970247 -0.794745 0.820444
C  1.289139 -0.210864 -1.348501
C  -0.811127 0.868957 1.035919
C  3.152488 -0.851409 0.156961
C  1.791785 -1.058394 2.279988
C  0.465845 0.225138 -2.509501
C  0.155362 2.039511 0.852177
C  -3.60714 -1.061172 -2.335406
H  -1.589962 -1.569292 1.574206
H  -3.304141 -2.093394 0.059294
H  -3.137361 -0.339798 0.117047
H  -0.354408 -2.700285 -0.993121
H  -1.339195 -3.567381 0.178765
H  0.245545 -2.972274 0.640859
H  4.120492 -1.104086 0.560819
H  2.736661 -1.326548 2.749267
H  1.40117 -0.185166 2.806536
H  1.090502 -1.874278 2.462512
H  0.665495 -0.380549 -3.393619
H  -0.591109 0.129233 -2.275385
H  0.67061 1.264317 -2.774501
H  1.13571 1.815614 1.272569
H  0.302708 2.245657 -0.20782
H  -3.347902 -1.045407 -3.393433
H  -4.111549 -0.118499 -2.088845
H  -4.323116 -1.876554 -2.169816
totalener: -1531.79210489 hartree
nucrepener: 1579.03089719 hartree
electener: -3110.82300208 hartree
oneelecener: -5240.64767911 hartree
twoeener: 2129.82467703 hartree
kineticenergy: 1527.45417843 hartree
xcener: -106.031383445465 hartree
chargesum: -0.0000000
charge: -0.109854 0.071026 -0.330063 -0.370071 -0.037655 0.080243 0.051719 -0.023316 -0.258077 -0.341544 -0.102560 0.251106 -0.028103 -0.194723 -0.270144 -0.090147 -0.119257 0.089653 0.077222 0.114712 0.106584 0.090557 0.096586 0.115034 0.092278 0.094771 0.090937 0.105405 0.114465 0.107103 0.125813 0.121556 0.102010 0.090041 0.086695
qa: -0.1099 0.0710 -0.3301 -0.3701 -0.0377 0.0802 0.0517 -0.0233 -0.2581 -0.3415 -0.1026 0.2511 -0.0281 -0.1947 -0.2701 -0.0901 -0.1193 0.0897 0.0772 0.1147 0.1066 0.0906 0.0966 0.1150 0.0923 0.0948 0.0909 0.1054 0.1145 0.1071 0.1258 0.1216 0.1020 0.0900 0.0867
va: 1.1645 2.7794 1.9528 2.1367 2.9599 3.8513 3.5523 3.9096 3.9356 3.9824 4.0253 4.1199 3.9285 3.9664 3.8934 4.0499 3.9292 1.0189 0.9972 1.0100 1.0077 1.0087 1.0053 1.0105 1.0073 0.9970 0.9998 1.0058 1.0341 0.9951 1.0035 1.0071 0.9947 0.9913 0.9935
dispcorr: -0.020293718 hartree
energy: -1531.812398609189
dipole: -8.85735 9.38851 0.53115 -19.67520 18.43835 -1.23685 -6.83509 6.05658 -0.77851
magnitude: 1.55499 au
magnitude: 3.95247 debye
