program: Gaussian 09
title: 000055960
version: EM64L-G09RevD.01
frameworkgroup: C1[X(C10H8F3N3O2)]
method: RPBEPBE
basis: SDD
operation: Freq
keyword: #p
keyword: freq=noraman
keyword: PBEPBE/SDD
title: #p freq=noraman PBEPBE/SDD
converged: YES YES NO NO
title: Mulliken charges:
elementType: F F F O O N N N C C C C C C C C C C H H H H H H H H
charge: -0.130888 -0.130018 -0.171169 -0.189013 -0.156873 -0.445510 0.040027 0.001178 0.356458 -0.151699 0.202247 0.153894 0.463956 -0.629768 0.103017 -0.799681 -0.827247 0.261036 0.253290 0.346158 0.250451 0.223930 0.259696 0.238983 0.237288 0.240257
chargesum: 0.00000
title: Mulliken charges with hydrogens summed into heavy atoms:
elementType: F F F O O N N N C C C C C C C C C C
charge: -0.130888 -0.130018 -0.171169 -0.189013 -0.156873 -0.099352 0.040027 0.001178 0.356458 -0.151699 0.202247 0.153894 0.463956 -0.376478 0.103017 -0.065604 -0.110718 0.261036
polarizability: 2.02933571e+02 -5.94981828e+00 1.52787030e+02 6.28404593e+00 -3.21761736e-01 7.98662543e+01
1716.lowfreq: -9.9685 -7.6285 -3.4399 -0.0008 0.0004 0.0011 16.1540 40.7582 60.3805
frequency: 15.7548 40.6202 60.3745 78.5150 93.8050 98.5079 136.5657 163.1331 176.0633 188.3195 253.8133 282.6632 293.6306 310.4354 337.4332 348.9204 379.8603 397.1181 408.8697 447.4429 493.4942 513.3937 521.0096 548.4428 619.7110 648.1092 655.9085 661.1456 695.8612 700.9429 713.0633 773.7880 783.1157 858.6491 876.2916 918.0823 969.3264 999.6266 1014.8616 1022.2280 1028.0850 1046.0598 1052.7355 1081.3563 1120.1567 1203.7315 1212.0972 1249.5135 1258.0961 1315.2685 1367.3173 1378.7152 1383.0182 1399.9846 1409.1125 1438.6419 1443.3159 1460.5017 1474.6205 1483.0691 1490.2272 1521.9519 1577.9988 1644.4572 2979.0125 2990.9422 3055.5690 3067.8011 3091.8595 3125.8261 3150.7700 3591.7759
redmass: 14.5446 2.4334 3.9794 2.3818 4.0531 8.8075 4.2627 3.3639 5.5848 1.3229 6.5292 7.8891 7.4225 5.0350 4.2242 4.5565 5.2110 5.4138 5.9627 6.6601 11.4081 6.6892 6.6934 8.1231 3.7506 2.6405 1.7653 4.8779 7.9005 8.5194 11.2550 6.5581 5.7245 3.9526 1.4746 10.2255 4.8141 10.0364 1.5842 11.5210 1.4665 1.8945 1.6355 4.2992 5.2608 1.9553 4.0521 4.5701 2.8598 7.9892 6.2336 7.9654 4.5792 1.2382 1.2858 1.8728 3.7142 1.0865 1.0977 1.3116 1.4574 4.4634 8.5440 8.2968 1.0382 1.0415 1.0964 1.0951 1.0988 1.0969 1.0929 1.0821
irintensity: 0.2865 0.3503 0.0579 1.1088 0.1893 0.8570 1.2358 4.2302 1.1388 0.3368 3.1986 9.4418 0.8341 4.0033 1.3175 0.7958 0.6590 3.2737 2.9682 5.2699 1.0415 3.8123 11.5337 3.3736 5.6240 25.9505 65.0497 15.5417 1.9704 0.5298 29.5535 1.5651 2.3672 6.1358 25.7139 56.1196 2.7148 181.3932 11.1006 240.5256 23.3077 1.8148 4.2036 200.8011 21.3400 30.9112 93.3511 125.1899 254.1735 16.9771 97.6029 52.4205 61.9234 8.5108 25.5927 21.0392 16.5468 3.2698 35.1202 20.4366 3.8575 46.0163 33.9221 5.0977 25.1981 14.2388 17.3402 11.4744 17.8491 5.5374 6.0766 106.9914
temp: 298.150 k
press: 1.00000 atm
elementType: 9 9 9 8 8 7 7 7 6 6 6 6 6 6 6 6 6 6 1 1 1 1 1 1 1 1
symmnumber: 1
zpe: 458124.8 jmol-1
zpe.correction: 0.174491 hartree
zpe.thermalcorrener: 0.190842 hartree
zpe.thermalcorrenthalpy: 0.191786 hartree
zpe.thermalcorrgfe: 0.128674 hartree
zpe.sumelectzpe: -998.716221 hartree
zpe.sumelectthermal: -998.699870 hartree
zpe.sumelectthermalent: -998.698926 hartree
zpe.sumelectthermalfe: -998.762037 hartree
dipole: 3.3219 -8.4758 -0.1227
dipole: 9.1043
quadrupole: -99.1814 -104.0862 -106.0081
quadrupole: -3.8890 -2.1495 0.0357
quadrupole: 3.9105 -0.9943 -2.9162 -3.8890 -2.1495 0.0357
hfenergy: -998.8907116 hartree
pointgroup: C01[X(C10H8F3N3O2)]
dipole: -1.30019 3.327647 0.2576022 debye
dipolederiv: -0.7032112 0.1473524 -0.155186 0.2956142 -0.428738 0.2301704 -0.221651 0.2252049 -0.5836149 -0.7322816 0.1248891 0.1826554 0.2554165 -0.3466176 -0.1668005 0.2711637 -0.1690127 -0.6399347 -0.6412042 -0.1928735 -0.0257387 -0.2134937 -0.6805229 -0.0421034 -0.0300329 -0.0444096 -0.2976597 -0.4283371 -0.1638523 0.2352622 -0.2280045 -0.6162586 0.133921 0.2273828 0.0098473 -0.5118895 -0.267656 0.0348506 0.1899629 0.028392 -0.6179474 -0.2005053 0.2227353 -0.0768396 -0.527765 -0.3849231 -0.0163508 -0.00229 -0.3358055 -0.5005582 -0.0176362 -0.0362988 -0.020248 -0.2356091 -0.248107 -0.2594645 -0.0115721 0.0110738 -0.2971869 -0.0005667 -0.0155463 -0.0067237 -0.1680003 0.4157744 0.1699966 -0.5052398 0.260218 1.311428 0.103005 -0.4779801 0.0932904 0.8841503 0.2924254 0.1189533 0.0185169 0.233729 -0.0734309 -0.0121832 0.0329474 -0.0087745 0.0985299 0.1167674 0.1947743 0.031128 -0.0710608 -0.1186895 -0.0078219 -0.0088297 -0.1154002 -0.0035794 0.1935766 -0.0026052 0.0022504 0.4968188 -0.09332 -0.0004787 0.0306218 0.1216756 -0.0340557 0.27413 -0.0699032 0.0644038 -0.0250063 -0.1780793 -0.0364054 0.0258149 -0.0225383 -0.0242701 0.0736314 -0.1765552 -0.0143544 -0.4927904 0.1898564 0.0134845 -0.016391 -0.0029289 -0.0224791 -0.0089344 0.0096982 -0.0006647 -0.0707285 0.0454333 0.0154352 -0.0058318 0.0234001 -0.186591 -0.6507572 0.107327 -0.0143328 0.0927666 0.6391777 0.0577119 -0.0145256 0.0725627 -0.0626112 -0.1770107 -0.0504131 0.0097863 -0.0404021 0.0244675 -0.0079225 0.0540559 -0.0362885 0.0725159 -0.1463927 0.1167377 0.0075322 0.0639662 0.0109881 0.0012539 -0.0216078 0.01404 0.0496281 2.5454441 -0.124469 0.0050043 -0.3413964 1.4322683 -0.0271121 -0.0023906 -0.0193423 1.5659283 0.072565 -0.0140393 -0.0030627 -0.0066194 -0.0682923 -0.0220154 -0.0019831 -0.0246675 0.169579 0.2739482 0.0409911 0.0010027 0.0575291 0.2382903 -0.0097371 0.002741 -0.0092477 0.3517089 0.0051255 -0.0032082 0.0436198 -0.0150205 0.1131812 -0.0314001 0.0836621 -0.0178349 -0.0513957 -0.011635 0.0349785 -0.0511495 0.0791234 0.0337775 0.0964397 -0.1028208 0.0764788 0.0235025 0.1038772 0.0306603 0.00734 -0.059826 -0.0497541 -0.0662706 -0.0030576 -0.0476444 0.0801134 -0.0188562 0.0173404 0.0887851 -0.00884 0.0629661 0.0764764 0.1222268 0.0197953 -0.0032021 0.0608672 -0.1222415 -0.0213745 -0.0005749 -0.1150817 -0.0384297 -0.0002006 -0.0420788 0.1061581 -0.0088261 0.0474263 -0.0822846 0.0349213 0.082643 -0.0405092 -0.1142038 0.0076845 -0.0491569 unknown
polarizability: 202.994009|-5.510378|152.1050709|-5.952762|7.14542|80.4877755 unknown
InChI: InChI=1S/C10H8F3N3O2/c1-4-3-6-7(8(5(4)2)16(17)18)15-9(14-6)10(11,12)13/h3,14H,1-2H3
charge 0 multiplicity 1
26 atoms
F  3.941145 -0.822001 1.10158
F  4.004823 -0.594754 -1.145326
F  4.144523 1.252162 0.180408
O  -2.36805 -2.707446 0.616002
O  -1.026777 -2.699005 -1.233012
N  1.44999 1.448573 0.111897
N  1.118102 -0.808872 -0.098496
N  -1.623083 -2.111756 -0.257325
C  0.064141 1.271571 0.063709
C  -0.11867 -0.143587 -0.073727
C  -2.55741 0.216625 -0.047434
C  -1.443326 -0.647231 -0.1224
C  -2.326105 1.639392 0.078786
C  -1.020287 2.166822 0.13827
C  2.019256 0.175992 0.013388
C  -3.983808 -0.296832 -0.112129
C  -3.508779 2.587437 0.150785
C  3.501774 -0.01807 0.034454
H  -0.870512 3.246158 0.240195
H  1.965333 2.322934 0.20911
H  -4.46169 -0.244031 0.884615
H  -4.58967 0.317826 -0.800415
H  -4.044975 -1.34474 -0.437529
H  -4.20779 2.304679 0.959152
H  -3.178402 3.623015 0.335344
H  -4.091149 2.584237 -0.790301
