program: Orca
programVersion: 5.0.2
elementType: Cl S O O N C C C C C C C C C C C C H H H H H H H H H H H H H H H H H H
charge: 0
multiplicity: 1
keywords: wb97x-d3
keywords: def2-TZVPP
keywords: def2/J RIJCOSX
keywords: DEFGRID2
keywords: scfconv7
keywords: smallprint printgap noloewdin
keywords: NOSOSCF
formula: C12H18ClNO2S
InChI: InChI=1/C12H18ClNO2S/c1-8-7-17-10(3)12(8)14(11(15)5-13)9(2)6-16-4/h7,9H,5-6H2,1-4H3
35 atoms
Cl 0.52951 3.328681 0.343528
S  3.245714 -0.26784 -0.901339
O  -2.923276 -2.685055 -0.172464
O  -2.19798 1.389951 0.807814
N  -0.537197 0.05314 0.046487
C  -1.453623 -0.899854 -0.602497
C  0.849454 -0.202466 -0.073376
C  -2.521963 -1.444623 0.348384
C  -2.05968 -0.351686 -1.886689
C  1.547113 -1.064442 0.836207
C  1.634069 0.29924 -1.073079
C  -1.01776 1.129035 0.726577
C  2.85676 -1.177842 0.499495
C  0.897982 -1.73257 2.003232
C  1.263348 1.189553 -2.207682
C  0.005644 2.011637 1.428284
C  -4.01476 -3.234326 0.504331
H  -0.821366 -1.752871 -0.859684
H  -2.105267 -1.560934 1.360358
H  -3.370463 -0.756377 0.424297
H  -2.639086 0.550869 -1.69862
H  -2.721545 -1.097902 -2.32525
H  -1.288598 -0.125038 -2.622224
H  3.617085 -1.751679 1.005947
H  1.62445 -2.296666 2.586462
H  0.426772 -1.010154 2.673657
H  0.119681 -2.428839 1.68498
H  1.311183 0.656442 -3.158524
H  0.252481 1.569356 -2.083449
H  1.92819 2.050025 -2.273815
H  -0.482581 2.471476 2.283907
H  0.897392 1.481461 1.754681
H  -4.268544 -4.1774 0.021473
H  -4.896635 -2.58192 0.471529
H  -3.7918 -3.438596 1.559845
totalener: -1531.79224751 hartree
nucrepener: 1575.99051199 hartree
electener: -3107.78275950 hartree
oneelecener: -5234.44084141 hartree
twoeener: 2126.65808191 hartree
kineticenergy: 1527.46286294 hartree
xcener: -106.028252429432 hartree
chargesum: -0.0000000
charge: -0.126963 0.072149 -0.324120 -0.388276 -0.010233 0.097298 -0.003160 0.003448 -0.313475 -0.218552 -0.081261 0.241452 -0.023016 -0.259242 -0.327034 -0.081833 -0.114328 0.083547 0.075696 0.109154 0.106003 0.107081 0.091960 0.113583 0.094352 0.092644 0.104256 0.121467 0.102651 0.119756 0.144950 0.124204 0.107176 0.082367 0.076301
qa: -0.1270 0.0721 -0.3241 -0.3883 -0.0102 0.0973 -0.0032 0.0034 -0.3135 -0.2186 -0.0813 0.2415 -0.0230 -0.2592 -0.3270 -0.0818 -0.1143 0.0835 0.0757 0.1092 0.1060 0.1071 0.0920 0.1136 0.0944 0.0926 0.1043 0.1215 0.1027 0.1198 0.1449 0.1242 0.1072 0.0824 0.0763
va: 1.1457 2.7816 1.9623 2.1130 2.8858 3.7917 3.7133 3.8849 3.9307 3.8601 3.9481 4.1622 3.9253 3.9854 3.9281 3.9949 3.9473 1.0187 0.9928 1.0074 1.0122 1.0189 0.9980 1.0112 1.0111 0.9928 0.9858 0.9941 1.0062 1.0025 1.0054 1.0046 0.9952 0.9922 0.9884
dispcorr: -0.020394055 hartree
energy: -1531.812641566143
dipole: -15.68675 16.23944 0.55270 -18.32624 17.35981 -0.96644 0.27663 0.07072 0.34735
magnitude: 1.16624 au
magnitude: 2.96436 debye
