program: Orca
programVersion: 5.0.2
elementType: Cl O O N C C C C C C C C C C C C C H H H H H H H H H H H H H H H H H H
charge: 0
multiplicity: 1
keywords: wb97x-d3
keywords: def2-TZVPP
keywords: def2/J RIJCOSX
keywords: DEFGRID2
keywords: scfconv7
keywords: smallprint printgap noloewdin
keywords: NOSOSCF
formula: C13H18ClNO2
InChI: InChI=1/C13H18ClNO2/c1-10-5-4-6-11(2)13(10)15(7-8-17-3)12(16)9-14/h4-6H,7-9H2,1-3H3
35 atoms
Cl -1.289317 3.050258 -0.393536
O  3.6796 -1.138139 -0.974327
O  1.565794 2.145274 0.852955
N  0.571329 0.148875 0.498359
C  -0.611859 -0.63433 0.338236
C  1.853326 -0.537263 0.392523
C  -1.239721 -0.717626 -0.9055
C  -1.092755 -1.331936 1.455959
C  2.411285 -0.527584 -1.021105
C  0.549753 1.466336 0.78368
C  -2.371758 -1.527286 -1.013368
C  -2.220483 -2.127147 1.305658
C  -0.758992 0.006361 -2.129263
C  -0.421722 -1.203309 2.790035
C  -2.855296 -2.228293 0.07513
C  -0.799378 2.105931 1.048349
C  4.26564 -1.253704 -2.250497
H  1.710017 -1.566683 0.722324
H  2.563605 -0.074057 1.077876
H  2.484391 0.501055 -1.398767
H  1.743317 -1.077235 -1.696303
H  -2.874719 -1.602036 -1.970008
H  -2.607093 -2.668135 2.160407
H  -0.012457 0.767456 -1.921824
H  -0.322751 -0.696679 -2.841018
H  -1.593126 0.4930 -2.634127
H  -0.993138 -1.721319 3.558681
H  0.582878 -1.631174 2.784248
H  -0.321805 -0.160423 3.096699
H  -3.735059 -2.849939 -0.029646
H  -1.598966 1.407077 1.272696
H  -0.693292 2.802917 1.876556
H  4.413635 -0.276577 -2.724105
H  3.659336 -1.868478 -2.925407
H  5.238727 -1.729304 -2.132209
elementType: Cl O N C H
totalener: -1171.71617046 hartree
nucrepener: 1396.78109021 hartree
electener: -2568.49726067 hartree
oneelecener: -4377.25574412 hartree
twoeener: 1808.75848345 hartree
cpcmener: -0.03371301 hartree
kineticenergy: 1167.81702091 hartree
xcener: -90.707883523494 hartree
chargesum: -0.0000000
charge: -0.159488 -0.394561 -0.541803 -0.023119 0.096882 0.007999 -0.125389 -0.154772 0.006432 0.322199 -0.093750 -0.066527 -0.326899 -0.258420 -0.180352 -0.078927 -0.116315 0.109344 0.098992 0.090648 0.093968 0.140973 0.142457 0.085611 0.123276 0.117472 0.103426 0.107097 0.104627 0.159444 0.144025 0.157983 0.094378 0.094870 0.118219
qa: -0.1595 -0.3946 -0.5418 -0.0231 0.0969 0.0080 -0.1254 -0.1548 0.0064 0.3222 -0.0937 -0.0665 -0.3269 -0.2584 -0.1804 -0.0789 -0.1163 0.1093 0.0990 0.0906 0.0940 0.1410 0.1425 0.0856 0.1233 0.1175 0.1034 0.1071 0.1046 0.1594 0.1440 0.1580 0.0944 0.0949 0.1182
va: 1.1120 1.9255 1.9606 3.0109 3.6025 3.7219 3.7993 3.9135 3.9271 4.0993 3.8343 3.7946 3.9432 3.9527 3.9330 3.9749 3.9063 1.0092 1.0281 1.0022 0.9858 0.9984 1.0007 1.0125 0.9905 1.0001 1.0042 0.9951 0.9959 0.9895 1.0101 1.0030 0.9882 0.9893 0.9927
dispcorr: -0.018682449 hartree
energy: -1171.734852905331
dipole: 8.10627 -9.50065 -1.39438 -16.02607 14.03016 -1.99591 -2.82934 2.68891 -0.14042
magnitude: 2.43879 au
magnitude: 6.19890 debye
