program: Orca
programVersion: 5.0.2
elementType: Cl O O N C C C C C C C C C C C C C H H H H H H H H H H H H H H H H H H
charge: 0
multiplicity: 1
keywords: wb97x-d3
keywords: def2-TZVPP
keywords: def2/J RIJCOSX
keywords: DEFGRID2
keywords: scfconv7
keywords: smallprint printgap noloewdin
keywords: NOSOSCF
formula: C13H18ClNO2
InChI: InChI=1/C13H18ClNO2/c1-10-5-4-6-11(2)13(10)15(7-8-17-3)12(16)9-14/h4-6H,7-9H2,1-3H3
35 atoms
Cl -1.904324 2.610798 0.354495
O  2.537324 -1.720281 -0.444461
O  1.564187 2.518699 0.14379
N  0.57363 0.554208 -0.362211
C  -0.443791 -0.416033 -0.122544
C  1.587006 0.260646 -1.373063
C  -1.456855 -0.568963 -1.078967
C  -0.401872 -1.209572 1.028816
C  2.834797 -0.397137 -0.824205
C  0.64858 1.722668 0.307522
C  -2.434467 -1.532969 -0.860813
C  -1.406001 -2.158632 1.212549
C  -1.501586 0.258689 -2.328341
C  0.652318 -1.073756 2.08875
C  -2.412358 -2.323499 0.277809
C  -0.468902 2.060979 1.276731
C  3.612629 -2.349167 0.211028
H  1.867466 1.184086 -1.877935
H  1.141051 -0.384964 -2.129522
H  3.228968 0.177149 0.024031
H  3.606025 -0.381995 -1.606559
H  -3.225411 -1.657931 -1.590235
H  -1.389942 -2.775001 2.103418
H  -1.09888 1.259681 -2.185064
H  -0.928005 -0.210248 -3.130972
H  -2.526238 0.35791 -2.684363
H  1.113668 -2.040445 2.29469
H  1.448038 -0.379006 1.832484
H  0.208509 -0.731227 3.025362
H  -3.182825 -3.066859 0.436561
H  -0.778657 1.234925 1.910003
H  -0.147886 2.886426 1.906074
H  3.298039 -3.355702 0.4850
H  3.905672 -1.817825 1.123589
H  4.496514 -2.427686 -0.432789
elementType: Cl O N C H
totalener: -1171.71660952 hartree
nucrepener: 1432.89178576 hartree
electener: -2604.60839528 hartree
oneelecener: -4450.27355609 hartree
twoeener: 1845.66516081 hartree
cpcmener: -0.03099153 hartree
kineticenergy: 1167.82117787 hartree
xcener: -90.710499736019 hartree
chargesum: 0.0000000
charge: -0.157727 -0.380062 -0.536541 0.012019 0.132879 -0.016548 -0.154534 -0.186043 -0.013240 0.308147 -0.070241 -0.088763 -0.292296 -0.317100 -0.195546 -0.048431 -0.128805 0.105550 0.109838 0.093521 0.106144 0.140098 0.140871 0.096379 0.115800 0.109548 0.117898 0.101186 0.126364 0.158114 0.142906 0.147036 0.118866 0.096957 0.105755
qa: -0.1577 -0.3801 -0.5365 0.0120 0.1329 -0.0165 -0.1545 -0.1860 -0.0132 0.3081 -0.0702 -0.0888 -0.2923 -0.3171 -0.1955 -0.0484 -0.1288 0.1056 0.1098 0.0935 0.1061 0.1401 0.1409 0.0964 0.1158 0.1095 0.1179 0.1012 0.1264 0.1581 0.1429 0.1470 0.1189 0.0970 0.1058
va: 1.1167 1.9074 1.9589 3.0088 3.5562 3.7789 3.8250 3.8064 3.9375 4.1085 3.8001 3.8213 3.9338 3.9468 3.9487 3.9620 3.8968 1.0265 1.0134 0.9985 1.0015 0.9998 0.9971 1.0109 0.9930 1.0005 0.9939 1.0013 0.9930 0.9900 1.0086 1.0130 0.9905 0.9893 0.9924
dispcorr: -0.019950572 hartree
energy: -1171.736560093412
dipole: 12.79293 -12.58397 0.20895 -15.35961 13.64317 -1.71644 -0.94567 1.33699 0.39133
magnitude: 1.77284 au
magnitude: 4.50619 debye
