program: Orca
programVersion: 5.0.2
elementType: Cl O O N C C C C C C C C C C C C C H H H H H H H H H H H H H H H H H H
charge: 0
multiplicity: 1
keywords: wb97x-d3
keywords: def2-TZVPP
keywords: def2/J RIJCOSX
keywords: DEFGRID2
keywords: scfconv7
keywords: smallprint printgap noloewdin
keywords: NOSOSCF
formula: C13H18ClNO2
InChI: InChI=1/C13H18ClNO2/c1-10-5-4-6-11(2)13(10)15(7-8-17-3)12(16)9-14/h4-6H,7-9H2,1-3H3
35 atoms
Cl -1.122738 3.239129 -0.640175
O  2.212646 -1.53224 -1.403174
O  1.557987 2.353353 0.625979
N  0.744518 0.246367 0.580017
C  -0.35899 -0.649593 0.447851
C  2.089221 -0.322624 0.651444
C  -0.963982 -0.843607 -0.795877
C  -0.803147 -1.321403 1.595124
C  2.788486 -0.467854 -0.682598
C  0.604378 1.586456 0.623961
C  -2.018681 -1.753234 -0.876082
C  -1.851073 -2.224128 1.470407
C  -0.565655 -0.100571 -2.0375
C  -0.197032 -1.044875 2.938018
C  -2.454389 -2.443072 0.240011
C  -0.801905 2.14228 0.735476
C  2.73711 -1.643332 -2.704972
H  2.022207 -1.300261 1.129631
H  2.701725 0.300621 1.301411
H  3.852665 -0.662787 -0.49051
H  2.733393 0.470022 -1.250105
H  -2.500193 -1.915668 -1.832983
H  -2.206564 -2.748876 2.348491
H  -0.375846 -0.796553 -2.855323
H  -1.375775 0.554167 -2.361111
H  0.320028 0.516661 -1.916181
H  0.84263 -1.370575 3.001055
H  -0.212189 0.021138 3.172127
H  -0.747073 -1.564947 3.720504
H  -3.273525 -3.145485 0.156545
H  -1.590904 1.398702 0.755609
H  -0.858186 2.732449 1.649258
H  2.240336 -2.477954 -3.198747
H  3.815635 -1.839799 -2.697275
H  2.564116 -0.73782 -3.297491
elementType: Cl O N C H
totalener: -1171.71680474 hartree
nucrepener: 1418.90487918 hartree
electener: -2590.62168392 hartree
oneelecener: -4422.14566778 hartree
twoeener: 1831.52398387 hartree
cpcmener: -0.03341536 hartree
kineticenergy: 1167.82092500 hartree
xcener: -90.709632920405 hartree
chargesum: -0.0000000
charge: -0.162787 -0.379148 -0.546339 0.000373 0.080885 -0.026129 -0.127335 -0.128382 -0.014521 0.323309 -0.099096 -0.081201 -0.321445 -0.259558 -0.181689 -0.073904 -0.128705 0.108680 0.106211 0.106018 0.094085 0.141347 0.141825 0.119506 0.117844 0.095891 0.104807 0.108087 0.102135 0.158968 0.141099 0.158129 0.119321 0.105316 0.096406
qa: -0.1628 -0.3791 -0.5463 0.0004 0.0809 -0.0261 -0.1273 -0.1284 -0.0145 0.3233 -0.0991 -0.0812 -0.3214 -0.2596 -0.1817 -0.0739 -0.1287 0.1087 0.1062 0.1060 0.0941 0.1413 0.1418 0.1195 0.1178 0.0959 0.1048 0.1081 0.1021 0.1590 0.1411 0.1581 0.1193 0.1053 0.0964
va: 1.1072 1.9081 1.9602 3.0358 3.6225 3.7896 3.7959 3.8867 3.9335 4.1014 3.8422 3.8100 3.9294 3.9437 3.9328 3.9859 3.8978 1.0148 1.0258 1.0014 0.9986 0.9978 1.0012 0.9961 1.0047 1.0035 0.9956 0.9953 1.0041 0.9898 1.0107 1.0024 0.9904 0.9927 0.9891
dispcorr: -0.019678976 hartree
energy: -1171.736483714698
dipole: 7.96770 -8.39698 -0.42928 -16.71081 14.78592 -1.92489 -1.01509 1.42704 0.41195
magnitude: 2.01474 au
magnitude: 5.12107 debye
