program: Orca
programVersion: 5.0.2
elementType: Cl O O N C C C C C C C C C C C C C H H H H H H H H H H H H H H H H H H
charge: 0
multiplicity: 1
keywords: wb97x-d3
keywords: def2-TZVPP
keywords: def2/J RIJCOSX
keywords: DEFGRID2
keywords: scfconv7
keywords: smallprint printgap noloewdin
keywords: NOSOSCF
formula: C13H18ClNO2
InChI: InChI=1/C13H18ClNO2/c1-10-5-4-6-11(2)13(10)15(7-8-17-3)12(16)9-14/h4-6H,7-9H2,1-3H3
35 atoms
Cl 0.233015 3.588838 -0.08149
O  2.710544 -0.24221 1.096368
O  -0.129543 0.868524 -2.109481
N  -0.018168 0.273127 0.060716
C  -0.940772 -0.792066 -0.168766
C  0.446628 0.449124 1.433543
C  -2.268081 -0.619295 0.239716
C  -0.508774 -1.97344 -0.779102
C  1.544171 -0.509143 1.836745
C  0.313209 1.057565 -0.98336
C  -3.157517 -1.674337 0.060421
C  -1.430138 -3.00584 -0.937635
C  -2.748453 0.659059 0.861371
C  0.884638 -2.148055 -1.304275
C  -2.741798 -2.863041 -0.517083
C  1.225337 2.240456 -0.733955
C  3.751246 -1.145556 1.391229
H  -0.396703 0.284376 2.104615
H  0.758707 1.477885 1.603629
H  1.215385 -1.547174 1.691098
H  1.724203 -0.380271 2.912502
H  -4.188079 -1.55494 0.371919
H  -1.109101 -3.931232 -1.400253
H  -2.238206 1.537014 0.465588
H  -3.816438 0.787527 0.689357
H  -2.598061 0.659814 1.943494
H  0.944105 -1.829479 -2.347326
H  1.626323 -1.57389 -0.754025
H  1.178454 -3.19657 -1.273107
H  -3.443479 -3.676891 -0.646227
H  2.036672 2.046592 -0.039289
H  1.64156 2.570481 -1.681646
H  4.607443 -0.888586 0.769033
H  3.466155 -2.18195 1.178501
H  4.056766 -1.086734 2.441996
elementType: Cl O N C H
totalener: -1171.71693734 hartree
nucrepener: 1411.75547999 hartree
electener: -2583.47241733 hartree
oneelecener: -4408.03267148 hartree
twoeener: 1824.56025416 hartree
cpcmener: -0.03396891 hartree
kineticenergy: 1167.81907229 hartree
xcener: -90.709267423593 hartree
chargesum: 0.0000000
charge: -0.160123 -0.384040 -0.535590 -0.049655 0.223829 -0.050343 -0.166508 -0.187698 -0.011974 0.316116 -0.089095 -0.080155 -0.277613 -0.264153 -0.192202 -0.091752 -0.116185 0.123920 0.109490 0.103772 0.114461 0.140853 0.140259 0.098024 0.106576 0.109712 0.110090 0.091416 0.110319 0.158523 0.137474 0.148368 0.117088 0.093313 0.103483
qa: -0.1601 -0.3840 -0.5356 -0.0497 0.2238 -0.0503 -0.1665 -0.1877 -0.0120 0.3161 -0.0891 -0.0802 -0.2776 -0.2642 -0.1922 -0.0918 -0.1162 0.1239 0.1095 0.1038 0.1145 0.1409 0.1403 0.0980 0.1066 0.1097 0.1101 0.0914 0.1103 0.1585 0.1375 0.1484 0.1171 0.0933 0.1035
va: 1.1137 1.9054 1.9589 3.0091 3.4886 3.8430 3.9191 3.8877 3.9167 4.1024 3.8251 3.8159 3.9199 3.8929 3.9475 3.9474 3.8870 1.0039 1.0207 0.9866 1.0008 1.0004 0.9998 1.0113 1.0039 0.9924 1.0032 1.0184 1.0010 0.9898 1.0291 1.0138 0.9920 0.9899 0.9918
dispcorr: -0.018953491 hartree
energy: -1171.735890830385
dipole: 5.63387 -4.60550 1.02837 -16.79188 15.52403 -1.26785 7.95485 -5.48261 2.47225
magnitude: 2.96260 au
magnitude: 7.53034 debye
