program: Orca
programVersion: 5.0.2
elementType: Cl O O N C C C C C C C C C C C C C H H H H H H H H H H H H H H H H H H
charge: 0
multiplicity: 1
keywords: wb97x-d3
keywords: def2-TZVPP
keywords: def2/J RIJCOSX
keywords: DEFGRID2
keywords: scfconv7
keywords: smallprint printgap noloewdin
keywords: NOSOSCF
formula: C13H18ClNO2
InChI: InChI=1/C13H18ClNO2/c1-10-5-4-6-11(2)13(10)15(7-8-17-3)12(16)9-14/h4-6H,7-9H2,1-3H3
35 atoms
Cl -1.478299 2.401143 1.853927
O  2.157529 -1.580761 -1.478303
O  1.215654 2.94438 -0.040058
N  0.750713 0.743305 -0.149424
C  -0.21143 -0.31021 -0.136036
C  2.191126 0.455851 -0.214146
C  -0.845704 -0.653581 -1.338419
C  -0.488096 -0.977828 1.05663
C  2.54061 -1.011098 -0.249661
C  0.392687 2.036014 -0.042045
C  -1.771712 -1.687363 -1.323337
C  -1.42343 -2.013552 1.029822
C  -0.557119 0.087305 -2.608935
C  0.186283 -0.642862 2.35398
C  -2.05767 -2.366982 -0.146023
C  -1.081309 2.360635 0.105822
C  2.086803 -2.985755 -1.426451
H  2.679617 0.884679 0.663969
H  2.61971 0.950849 -1.089007
H  2.086304 -1.544366 0.593363
H  3.626997 -1.085481 -0.110279
H  -2.272295 -1.965127 -2.242655
H  -1.649729 -2.543048 1.947588
H  -1.092524 -0.361073 -3.443362
H  -0.865748 1.132581 -2.553686
H  0.503805 0.082161 -2.854095
H  -0.552234 -0.456079 3.133632
H  0.800044 -1.479732 2.69171
H  0.82808 0.23239 2.292671
H  -2.779842 -3.173171 -0.150295
H  -1.266843 3.352625 -0.297072
H  -1.755744 1.652287 -0.364246
H  1.784853 -3.344325 -2.409647
H  1.351103 -3.330172 -0.690445
H  3.052502 -3.439462 -1.17642
elementType: Cl O N C H
totalener: -1171.71407852 hartree
nucrepener: 1445.52874421 hartree
electener: -2617.24282273 hartree
oneelecener: -4475.16479735 hartree
twoeener: 1857.92197462 hartree
cpcmener: -0.03221421 hartree
kineticenergy: 1167.82950782 hartree
xcener: -90.713400483212 hartree
chargesum: 0.0000000
charge: -0.159243 -0.382556 -0.544645 0.013514 0.163486 -0.050011 -0.245452 -0.178039 -0.013396 0.327215 -0.043831 -0.091216 -0.248274 -0.299863 -0.192501 -0.068013 -0.114285 0.113106 0.109552 0.105170 0.110916 0.141708 0.140919 0.101470 0.100781 0.099120 0.113097 0.121047 0.095234 0.158638 0.152811 0.147495 0.119139 0.087317 0.109590
qa: -0.1592 -0.3826 -0.5446 0.0135 0.1635 -0.0500 -0.2455 -0.1780 -0.0134 0.3272 -0.0438 -0.0912 -0.2483 -0.2999 -0.1925 -0.0680 -0.1143 0.1131 0.1096 0.1052 0.1109 0.1417 0.1409 0.1015 0.1008 0.0991 0.1131 0.1210 0.0952 0.1586 0.1528 0.1475 0.1191 0.0873 0.1096
va: 1.1148 1.9082 1.9629 3.0160 3.3588 3.8070 3.8905 3.8237 3.9991 4.0757 3.7553 3.8319 3.9490 3.9281 3.9503 3.9642 3.8897 1.0074 1.0103 0.9793 1.0038 0.9992 0.9977 1.0048 0.9957 1.0126 0.9997 0.9953 1.0080 0.9898 1.0070 1.0091 0.9914 0.9880 0.9924
dispcorr: -0.021090440 hartree
energy: -1171.735168960182
dipole: 8.28631 -8.71780 -0.43149 -17.36251 14.85649 -2.50602 -8.06971 7.78242 -0.28729
magnitude: 2.55907 au
magnitude: 6.50464 debye
