program: Orca
programVersion: 5.0.2
elementType: Cl O O N C C C C C C C C C C C C C H H H H H H H H H H H H H H H H H H
charge: 0
multiplicity: 1
keywords: wb97x-d3
keywords: def2-TZVPP
keywords: def2/J RIJCOSX
keywords: DEFGRID2
keywords: scfconv7
keywords: smallprint printgap noloewdin
keywords: NOSOSCF
formula: C13H18ClNO2
InChI: InChI=1/C13H18ClNO2/c1-10-5-4-6-11(2)13(10)15(7-8-17-3)12(16)9-14/h4-6H,7-9H2,1-3H3
35 atoms
Cl -1.4869 2.549879 1.718136
O  2.57888 -1.377865 -1.414642
O  1.551487 2.390192 0.436669
N  0.660324 0.327608 0.241034
C  -0.472814 -0.51392 0.026956
C  1.935302 -0.287663 0.613303
C  -0.954827 -0.710104 -1.273618
C  -1.065366 -1.136774 1.130494
C  2.960284 -0.380618 -0.496393
C  0.576245 1.673877 0.252485
C  -2.049571 -1.551492 -1.448332
C  -2.154456 -1.976024 0.910025
C  -0.344199 -0.02886 -2.462291
C  -0.553395 -0.938412 2.526068
C  -2.643096 -2.185068 -0.368249
C  -0.792257 2.307786 0.082387
C  3.485178 -1.493816 -2.48582
H  1.729975 -1.289591 0.988874
H  2.371354 0.271118 1.441477
H  3.926425 -0.630196 -0.036285
H  3.086952 0.586715 -0.997869
H  -2.437596 -1.711026 -2.446676
H  -2.625163 -2.462231 1.755642
H  0.696927 -0.315024 -2.600214
H  -0.884644 -0.294542 -3.368924
H  -0.367178 1.05917 -2.38532
H  -0.231256 0.084625 2.713872
H  -1.32617 -1.183228 3.253276
H  0.298946 -1.588715 2.733079
H  -3.491811 -2.838394 -0.523702
H  -0.67774 3.285957 -0.377277
H  -1.50861 1.726172 -0.487778
H  4.480367 -1.80434 -2.146449
H  3.594785 -0.55292 -3.036908
H  3.103725 -2.250734 -3.170314
elementType: Cl O N C H
totalener: -1171.71672488 hartree
nucrepener: 1418.02890750 hartree
electener: -2589.74563237 hartree
oneelecener: -4420.43899615 hartree
twoeener: 1830.69336378 hartree
cpcmener: -0.03074610 hartree
kineticenergy: 1167.81962518 hartree
xcener: -90.708838238266 hartree
chargesum: -0.0000000
charge: -0.157454 -0.387700 -0.539271 0.006509 0.115238 -0.015046 -0.198280 -0.158656 -0.003504 0.328467 -0.071934 -0.082909 -0.258032 -0.276192 -0.187948 -0.089730 -0.128726 0.107069 0.111697 0.101409 0.091033 0.141914 0.139868 0.107357 0.102396 0.098357 0.097746 0.107652 0.110504 0.159150 0.155898 0.150075 0.105527 0.097837 0.119678
qa: -0.1575 -0.3877 -0.5393 0.0065 0.1152 -0.0150 -0.1983 -0.1587 -0.0035 0.3285 -0.0719 -0.0829 -0.2580 -0.2762 -0.1879 -0.0897 -0.1287 0.1071 0.1117 0.1014 0.0910 0.1419 0.1399 0.1074 0.1024 0.0984 0.0977 0.1077 0.1105 0.1591 0.1559 0.1501 0.1055 0.0978 0.1197
va: 1.1190 1.9051 1.9597 3.0339 3.5949 3.7784 3.8789 3.8458 3.9360 4.0711 3.7996 3.8192 3.9533 3.9315 3.9469 3.9775 3.8933 1.0167 1.0202 0.9973 1.0053 1.0001 1.0010 1.0010 1.0060 0.9973 1.0126 1.0016 0.9935 0.9899 1.0060 1.0093 0.9936 0.9899 0.9906
dispcorr: -0.019223297 hartree
energy: -1171.735948173317
dipole: 10.73861 -10.92073 -0.18212 -13.58171 12.09688 -1.48483 -10.71298 9.66883 -1.04415
magnitude: 1.82432 au
magnitude: 4.63705 debye
