program: Orca
programVersion: 5.0.2
elementType: Cl O O N C C C C C C C C C C C C C H H H H H H H H H H H H H H H H H H
charge: 0
multiplicity: 1
keywords: wb97x-d3
keywords: def2-TZVPP
keywords: def2/J RIJCOSX
keywords: DEFGRID2
keywords: scfconv7
keywords: smallprint printgap noloewdin
keywords: NOSOSCF
formula: C13H18ClNO2
InChI: InChI=1/C13H18ClNO2/c1-10-5-4-6-11(2)13(10)15(7-8-17-3)12(16)9-14/h4-6H,7-9H2,1-3H3
35 atoms
Cl 0.308689 3.587743 -0.068353
O  2.696076 -0.238907 1.089825
O  -0.11689 0.870786 -2.108643
N  -0.026146 0.271407 0.061303
C  -0.949816 -0.791422 -0.171489
C  0.435246 0.446082 1.434355
C  -2.276154 -0.624553 0.243321
C  -0.518812 -1.970685 -0.788231
C  1.538874 -0.50588 1.838688
C  0.324281 1.050819 -0.985425
C  -3.163213 -1.682062 0.066727
C  -1.438121 -3.004687 -0.944881
C  -2.759588 0.65016 0.869459
C  0.871895 -2.140503 -1.321127
C  -2.747322 -2.86758 -0.515785
C  1.260892 2.214724 -0.729604
C  3.753723 -1.114484 1.392833
H  -0.408339 0.275962 2.104434
H  0.743102 1.47654 1.604752
H  1.211751 -1.546651 1.702919
H  1.723535 -0.36936 2.913812
H  -4.193023 -1.567876 0.38314
H  -1.118525 -3.927798 -1.413163
H  -2.23336 1.527502 0.496438
H  -3.821888 0.792048 0.673412
H  -2.637631 0.636175 1.954947
H  0.92175 -1.829332 -2.366346
H  1.613495 -1.557818 -0.780018
H  1.173182 -3.186963 -1.285316
H  -3.447304 -3.683286 -0.643712
H  2.068477 1.996286 -0.037392
H  1.683443 2.5387 -1.676906
H  4.597273 -0.857578 0.752385
H  3.487408 -2.162601 1.21044
H  4.074259 -1.02526 2.437992
elementType: Cl O N C H
totalener: -1171.72475468 hartree
nucrepener: 1411.62014823 hartree
electener: -2583.34490291 hartree
oneelecener: -4407.63991258 hartree
twoeener: 1824.29500967 hartree
cpcmener: -0.02679361 hartree
kineticenergy: 1167.82465610 hartree
xcener: -90.708732064431 hartree
chargesum: 0.0000000
charge: -0.160596 -0.368475 -0.493488 -0.055669 0.230959 -0.062085 -0.163651 -0.185061 -0.008472 0.292864 -0.087764 -0.078038 -0.278484 -0.263169 -0.188792 -0.092891 -0.118836 0.121386 0.109132 0.100838 0.110002 0.136958 0.136443 0.099394 0.105534 0.107371 0.112196 0.088763 0.107637 0.154510 0.134902 0.147522 0.115164 0.092293 0.101603
qa: -0.1606 -0.3685 -0.4935 -0.0557 0.2310 -0.0621 -0.1637 -0.1851 -0.0085 0.2929 -0.0878 -0.0780 -0.2785 -0.2632 -0.1888 -0.0929 -0.1188 0.1214 0.1091 0.1008 0.1100 0.1370 0.1364 0.0994 0.1055 0.1074 0.1122 0.0888 0.1076 0.1545 0.1349 0.1475 0.1152 0.0923 0.1016
va: 1.1135 1.9215 2.0121 2.9891 3.5010 3.8544 3.9184 3.8941 3.9144 4.1346 3.8316 3.8220 3.9193 3.8901 3.9550 3.9376 3.8947 1.0039 1.0222 0.9868 1.0009 1.0013 1.0007 1.0113 1.0040 0.9923 1.0029 1.0203 1.0012 0.9912 1.0321 1.0140 0.9924 0.9900 0.9918
dispcorr: -0.018934038 hartree
energy: -1171.743688718861
dipole: 5.38040 -4.38894 0.99145 -16.76944 15.54990 -1.21953 7.92287 -5.64328 2.27959
magnitude: 2.76889 au
magnitude: 7.03796 debye
