program: Gaussian 09
title: 000056113
version: EM64L-G09RevD.01
frameworkgroup: C1[X(C18H30N4O4S)]
method: RPBEPBE
basis: SDD
operation: Freq
keyword: #p
keyword: freq=noraman
keyword: PBEPBE/SDD
title: #p freq=noraman PBEPBE/SDD
converged: YES YES NO NO
title: Mulliken charges:
elementType: S O O O O N N N N C C C C C C C C C C C C C C C C C C H H H H H H H H H H H H H H H H H H H H H H H H H H H H H H
charge: 0.907841 -0.306812 -0.335954 -0.620275 -0.597106 -0.127747 -0.364542 -0.282566 -0.255793 -0.002002 -0.475541 -0.467945 -0.364858 -0.476091 -0.328015 -0.697961 0.162716 0.123365 -0.556777 0.272507 0.542146 -0.543918 -0.371456 -0.367219 -0.605338 -0.607872 -0.526366 0.253378 0.217526 0.209437 0.221356 0.216294 0.174655 0.226055 0.231207 0.250683 0.179665 0.232051 0.354585 0.217962 0.223785 0.209970 0.284839 0.250997 0.296186 0.331784 0.248422 0.312599 0.272329 0.190874 0.242954 0.274099 0.243744 0.190363 0.243224 0.233407 0.239150
chargesum: 0.00000
title: Mulliken charges with hydrogens summed into heavy atoms:
elementType: S O O O O N N N N C C C C C C C C C C C C C C C C C C
charge: 0.907841 -0.306812 -0.335954 -0.620275 -0.597106 -0.127747 -0.009957 0.049217 -0.255793 0.251376 -0.048578 -0.030295 0.035852 0.005800 0.083702 -0.046245 0.162716 0.123365 -0.271939 0.272507 0.542146 0.003265 -0.123034 -0.054620 0.100819 0.100334 0.189415
polarizability: 5.00244543e+02 -3.61179336e+01 2.69627303e+02 3.56130684e+01 7.62549017e+00 2.09350169e+02
1716.lowfreq: -8.4844 -2.5456 0.0013 0.0017 0.0022 3.0080 9.8914 15.7432 21.2729
frequency: 7.4845 15.6126 21.2454 25.8566 31.4839 39.0430 52.1319 55.7158 58.0486 63.1560 78.6817 82.2746 102.0895 114.1826 129.0222 139.4827 158.7243 173.6103 178.7989 200.9201 212.2021 215.1556 220.2739 230.1597 234.0140 240.4599 248.5333 260.6192 277.9848 281.8009 301.7231 314.8087 342.8731 352.0413 354.8616 370.2980 378.4794 398.1310 407.5216 415.7144 429.4388 442.7708 454.8338 497.3802 533.2527 563.6448 569.5376 593.7470 603.6493 633.2655 671.1048 696.7209 708.2068 714.7444 754.3002 761.9995 771.9675 793.9333 807.2914 820.8392 831.4980 834.0522 859.2274 870.0436 880.9273 896.4729 905.3775 933.0421 945.1053 959.0660 973.7450 983.3272 985.8113 987.9984 1007.6747 1018.9646 1033.6996 1072.2191 1073.2104 1088.9214 1096.2309 1099.7692 1100.9534 1113.4977 1122.2300 1127.5302 1147.4061 1152.9192 1163.4617 1181.2546 1188.6693 1191.4899 1201.6913 1204.3477 1206.8081 1225.8901 1235.9417 1248.8092 1256.5632 1278.1207 1290.9995 1295.0373 1298.2342 1309.3686 1338.1820 1339.7623 1353.3256 1356.4536 1378.5274 1388.9635 1389.5767 1402.4034 1413.2747 1414.4287 1435.7973 1437.8665 1456.0609 1458.3504 1460.4076 1462.3296 1468.2557 1469.2418 1470.9365 1472.4383 1472.7438 1474.4879 1474.6611 1487.0988 1487.5633 1496.6628 1524.0930 1531.9774 1575.7095 1598.0404 1628.6323 2836.8538 2844.7936 2896.3827 2899.4305 2931.8603 2978.0951 2982.7005 3000.8524 3008.7411 3014.8435 3016.1863 3017.6124 3022.0051 3032.0661 3055.4585 3074.6074 3077.3104 3079.2990 3079.8758 3080.5037 3084.1064 3087.4110 3092.3747 3111.0676 3124.1200 3131.1743 3171.6622 3236.2279 3455.6532 3523.8306
redmass: 4.4474 4.2269 3.8198 5.5343 3.9281 4.1658 3.5282 3.6191 4.4046 6.0521 2.6092 4.6424 5.1702 4.5768 4.0840 3.7214 2.1363 2.0921 3.8127 4.9394 3.3341 2.5489 1.1791 2.7029 1.5815 1.2803 1.7197 2.5651 2.8163 2.8189 3.2843 4.4151 2.2891 4.4879 4.6913 3.5596 4.6362 3.5529 4.9923 7.0593 2.7470 3.5743 4.8629 3.6734 2.9449 2.7838 3.0160 3.6866 2.5364 2.1852 5.2879 4.6373 3.9702 1.1319 3.4853 4.6931 10.6447 1.2014 2.4437 1.9245 1.4042 1.5163 4.2130 2.4236 2.6422 7.7979 2.1453 2.2814 1.4712 2.0198 1.5141 1.5013 1.6374 2.6961 2.1729 1.3527 2.6361 2.1534 1.2338 2.4047 2.0470 1.4562 2.1615 1.2539 2.0905 1.5461 1.7766 1.3886 1.5004 6.1398 1.7660 2.0062 1.9678 2.2948 1.6822 1.3101 2.9973 1.3309 1.7333 1.2236 2.0264 1.2677 1.3664 1.2859 1.3519 1.3307 1.5443 1.8126 1.3470 4.3772 1.3129 1.1293 1.1476 2.9425 1.1348 1.2039 1.0986 1.1699 1.0603 1.0885 1.0505 1.0467 1.0486 1.1905 1.1160 1.0580 1.0633 1.6985 1.1612 1.0906 1.8666 2.1224 5.2058 5.2533 6.1677 1.0722 1.0708 1.0475 1.0470 1.0839 1.0316 1.0355 1.0594 1.0655 1.0591 1.0860 1.0841 1.0879 1.0868 1.1023 1.1051 1.0989 1.0968 1.1046 1.0982 1.1053 1.1003 1.0966 1.0556 1.0915 1.1014 1.0920 1.1208 1.0802 1.0768
irintensity: 0.5270 0.6464 0.1160 4.2271 1.0217 4.1217 0.8715 3.2993 3.4893 2.2442 0.3283 2.7734 3.9460 6.6132 2.1367 9.0045 5.2132 14.7379 0.6985 0.7952 19.0608 15.1352 0.8721 28.2566 3.0774 2.3183 0.6190 16.7569 14.1077 14.6526 15.3317 5.8362 7.4248 11.5986 5.5645 4.7313 2.4340 4.2121 12.8475 15.1950 7.9747 2.9561 33.0625 19.5520 17.2369 8.8038 47.0997 5.6325 10.9997 40.8605 4.0398 23.2231 21.3706 89.2728 2.2048 6.1733 25.9491 7.7049 4.3828 6.8856 3.6914 70.6026 76.1713 1.6579 4.3807 76.9548 6.1080 4.9953 28.6993 1.9276 13.8296 156.5151 9.8548 51.4990 1.5294 0.7814 8.2912 31.4105 0.2493 24.2608 20.7559 47.1741 9.5641 0.0686 6.6418 13.3680 33.2649 1.5290 9.7898 9.8959 80.8401 6.2398 89.3507 51.4283 37.8184 1.7881 130.1320 15.3669 57.7537 11.4245 27.4746 17.3589 5.2544 0.9179 5.8309 4.6548 45.2172 185.7282 0.2282 20.9399 36.3544 20.5858 2.2981 2.6840 21.0111 5.9400 12.8551 33.4752 8.4734 7.4029 14.4268 7.0015 10.6321 122.7368 47.6758 41.9014 16.2139 153.6877 19.5264 8.6268 190.3041 368.8281 97.3541 35.6588 56.9325 50.0480 181.1027 43.0183 312.4483 30.0390 55.9975 36.7324 35.8330 38.4963 47.4927 3.2525 49.7550 20.4486 62.5370 19.5569 29.9763 51.9012 3.1013 48.6776 3.7754 22.3974 42.2792 26.6150 3.8141 14.4983 19.9650 9.2309 1.3363 132.5197 83.0326
temp: 298.150 k
press: 1.00000 atm
elementType: 16 8 8 8 8 7 7 7 7 6 6 6 6 6 6 6 6 6 6 6 6 6 6 6 6 6 6 1 1 1 1 1 1 1 1 1 1 1 1 1 1 1 1 1 1 1 1 1 1 1 1 1 1 1 1 1 1
symmnumber: 1
zpe: 1229466.9 jmol-1
zpe.correction: 0.468279 hartree
zpe.thermalcorrener: 0.499453 hartree
zpe.thermalcorrenthalpy: 0.500398 hartree
zpe.thermalcorrgfe: 0.400800 hartree
zpe.sumelectzpe: -1619.597475 hartree
zpe.sumelectthermal: -1619.566301 hartree
zpe.sumelectthermalent: -1619.565357 hartree
zpe.sumelectthermalfe: -1619.664955 hartree
dipole: 0.0129 1.1168 -2.6097
dipole: 2.8386
quadrupole: -156.6411 -146.9155 -175.8970
quadrupole: -28.4962 -29.4839 2.9044
quadrupole: 3.1768 12.9023 -16.0791 -28.4962 -29.4839 2.9044
hfenergy: -1620.0657543 hartree
pointgroup: C01 [X(C18H30N4O4S1)]
dipole: -0.0102188 -0.513951 0.9914577 debye
polarizability: 503.0542703|18.8274537|263.2529633|-40.1114978|14.2763846|212.9147814 unknown
InChI: InChI=1S/C16H24N3O2.C2H6NO2S/c1-4-19-9-5-6-13(19)11-18-16(20)14-10-12(17-2)7-8-15(14)21-3;1-3(2)6(4)5/h7-8,10,13,17-18H,2,4-6,9,11H2,1,3H3;1-2H3
charge 0 multiplicity 1
57 atoms
S  5.382338 -0.400508 -0.518918
O  -1.820298 0.955354 1.448527
O  -1.206859 -3.034725 0.057531
O  5.406651 -2.052688 -0.511253
O  4.347839 0.389421 -1.518491
N  -5.908926 1.098786 -0.027011
N  -2.839997 -1.008426 0.737703
N  3.116809 0.372251 1.373843
N  7.12013 0.028426 -1.264842
C  -4.647813 0.368082 -0.364535
C  -4.997617 -0.500921 -1.60962
C  -6.54814 -0.465287 -1.686555
C  -6.87406 0.940195 -1.142727
C  -4.195366 -0.455747 0.874546
C  -5.711639 2.473016 0.480238
C  -6.973097 3.045655 1.152142
C  -1.730249 -0.247449 1.024893
C  -0.369939 -0.891627 0.833977
C  0.731882 -0.069752 1.149898
C  -0.101184 -2.220115 0.377156
C  2.06106 -0.525614 1.02427
C  4.413139 0.03312 1.609228
C  1.232985 -2.674962 0.245641
C  2.31991 -1.837159 0.556303
C  8.210557 -0.648823 -0.539082
C  7.2768 1.476151 -1.493341
C  -0.957328 -4.385887 -0.46019
H  -3.82441 1.076084 -0.605445
H  -4.564899 -0.050865 -2.521698
H  -4.595891 -1.527416 -1.528641
H  -6.931754 -0.625692 -2.708966
H  -6.991841 -1.231834 -1.025201
H  -6.723357 1.710423 -1.943203
H  -7.915455 1.027162 -0.78398
H  -4.908021 -1.282844 1.043318
H  -4.213764 0.205898 1.757866
H  -5.383198 3.162423 -0.341549
H  -4.885365 2.446035 1.215215
H  -2.685568 -1.96187 0.391196
H  -7.807433 3.146613 0.434323
H  -7.303162 2.383714 1.972421
H  -6.76561 4.048295 1.569131
H  0.489655 0.940588 1.503905
H  5.069227 0.833616 1.961733
H  4.630543 -0.99183 1.923713
H  2.888523 1.366448 1.285828
H  1.446239 -3.677673 -0.133695
H  3.342802 -2.190164 0.368355
H  7.877767 -1.669811 -0.283075
H  8.55302 -0.117052 0.379322
H  9.074381 -0.737973 -1.225645
H  6.32388 1.873147 -1.884412
H  8.048201 1.616934 -2.274783
H  7.590055 2.054267 -0.592396
H  -1.954775 -4.811484 -0.643033
H  -0.418593 -5.000981 0.284015
H  -0.386479 -4.346326 -1.406048
