program: Orca
programVersion: 5.0.2
elementType: Cl O O N C C C C C C C C C C C C C H H H H H H H H H H H H H H H H H H
charge: 0
multiplicity: 1
keywords: wb97x-d3
keywords: def2-TZVPP
keywords: def2/J RIJCOSX
keywords: DEFGRID2
keywords: scfconv7
keywords: smallprint printgap noloewdin
keywords: NOSOSCF
formula: C13H18ClNO2
InChI: InChI=1/C13H18ClNO2/c1-10-5-4-6-11(2)13(10)15(7-8-17-3)12(16)9-14/h4-6H,7-9H2,1-3H3
35 atoms
Cl -1.601253 2.744855 0.411496
O  3.300137 -0.68627 -0.088335
O  1.785662 2.185172 0.116913
N  0.550816 0.366773 -0.423008
C  -0.56612 -0.483593 -0.174836
C  1.467528 -0.041975 -1.482424
C  -1.627822 -0.483873 -1.090081
C  -0.564215 -1.334768 0.93769
C  2.414864 -1.148651 -1.075846
C  0.793537 1.496302 0.281679
C  -2.694123 -1.348181 -0.867514
C  -1.654178 -2.181419 1.12469
C  -1.641991 0.399752 -2.30166
C  0.534612 -1.338724 1.959765
C  -2.70967 -2.192605 0.23052
C  -0.260923 1.931887 1.284433
C  4.114041 -1.710045 0.42615
H  2.02275 0.828493 -1.829001
H  0.882578 -0.400656 -2.330311
H  2.96019 -1.476344 -1.972207
H  1.845681 -2.019135 -0.719162
H  -3.524033 -1.353121 -1.563968
H  -1.667117 -2.841856 1.983681
H  -1.064369 1.311762 -2.167997
H  -1.235898 -0.121067 -3.172119
H  -2.662782 0.687099 -2.552568
H  1.464171 -0.906911 1.598507
H  0.239733 -0.772969 2.847602
H  0.744722 -2.354867 2.293812
H  -3.547678 -2.859206 0.389845
H  -0.696082 1.125335 1.866389
H  0.177694 2.660659 1.960745
H  4.765583 -2.145039 -0.341484
H  3.524632 -2.523263 0.867361
H  4.743426 -1.281292 1.205981
elementType: Cl O N C H
totalener: -1171.72421200 hartree
nucrepener: 1428.06354018 hartree
electener: -2599.78775217 hartree
oneelecener: -4440.39919806 hartree
twoeener: 1840.61144588 hartree
cpcmener: -0.02903394 hartree
kineticenergy: 1167.82569599 hartree
xcener: -90.710360359586 hartree
chargesum: -0.0000000
charge: -0.157438 -0.369175 -0.491830 0.001854 0.111400 -0.037789 -0.151861 -0.172462 -0.003686 0.282234 -0.071040 -0.071715 -0.303973 -0.313186 -0.189138 -0.056415 -0.121668 0.101221 0.119154 0.109552 0.094568 0.136878 0.137908 0.098126 0.116404 0.109286 0.106388 0.120613 0.115502 0.155172 0.137400 0.148517 0.100564 0.090355 0.118281
qa: -0.1574 -0.3692 -0.4918 0.0019 0.1114 -0.0378 -0.1519 -0.1725 -0.0037 0.2822 -0.0710 -0.0717 -0.3040 -0.3132 -0.1891 -0.0564 -0.1217 0.1012 0.1192 0.1096 0.0946 0.1369 0.1379 0.0981 0.1164 0.1093 0.1064 0.1206 0.1155 0.1552 0.1374 0.1485 0.1006 0.0904 0.1183
va: 1.1177 1.9241 2.0142 2.9712 3.5921 3.8127 3.8245 3.8002 3.9134 4.1515 3.8129 3.8122 3.9323 3.9208 3.9622 3.9508 3.8974 1.0361 1.0008 1.0022 0.9861 1.0001 0.9993 1.0119 0.9920 1.0003 1.0142 0.9908 0.9994 0.9910 1.0128 1.0107 0.9919 0.9895 0.9913
dispcorr: -0.019646570 hartree
energy: -1171.743858565537
dipole: 9.87838 -10.53905 -0.66067 -17.85220 15.29982 -2.55238 -1.99639 1.97569 -0.02069
magnitude: 2.63658 au
magnitude: 6.70165 debye
