program: Orca
programVersion: 5.0.2
elementType: Cl O O N C C C C C C C C C C C C C H H H H H H H H H H H H H H H H H H
charge: 0
multiplicity: 1
keywords: wb97x-d3
keywords: def2-TZVPP
keywords: def2/J RIJCOSX
keywords: DEFGRID2
keywords: scfconv7
keywords: smallprint printgap noloewdin
keywords: NOSOSCF
formula: C13H18ClNO2
InChI: InChI=1/C13H18ClNO2/c1-10-5-4-6-11(2)13(10)15(7-8-17-3)12(16)9-14/h4-6H,7-9H2,1-3H3
35 atoms
Cl -1.23956 2.773803 -0.218517
O  3.442179 -0.981977 -1.481082
O  1.674352 1.722663 1.354489
N  0.508325 0.034185 0.416365
C  -0.727559 -0.66202 0.282728
C  1.734782 -0.697238 0.109936
C  -1.308637 -0.793563 -0.980685
C  -1.295718 -1.260828 1.412579
C  2.664553 0.0132 -0.869656
C  0.609272 1.239104 1.039081
C  -2.501269 -1.500862 -1.087198
C  -2.49101 -1.954809 1.266329
C  -0.657351 -0.222752 -2.203314
C  -0.636513 -1.167634 2.759306
C  -3.093938 -2.070958 0.02555
C  -0.682903 2.002318 1.294136
C  4.456093 -0.461134 -2.289151
H  1.431748 -1.644148 -0.336265
H  2.27531 -0.932004 1.031261
H  3.292946 0.742609 -0.347763
H  2.074252 0.568719 -1.612821
H  -2.968272 -1.604283 -2.058622
H  -2.9456 -2.418295 2.133115
H  -0.346702 0.809433 -2.052557
H  0.229222 -0.795517 -2.48433
H  -1.339254 -0.246864 -3.051935
H  -1.088664 -1.869816 3.457878
H  0.429047 -1.39115 2.711757
H  -0.731427 -0.174522 3.205399
H  -4.023336 -2.615726 -0.075429
H  -1.500887 1.384862 1.656537
H  -0.473293 2.792361 2.010036
H  5.156902 0.166943 -1.724337
H  4.061489 0.142711 -3.117013
H  5.010778 -1.297953 -2.712246
totalener: -1171.70091100 hartree
nucrepener: 1403.68237313 hartree
electener: -2575.38328413 hartree
oneelecener: -4390.95090552 hartree
twoeener: 1815.56762139 hartree
kineticenergy: 1167.86932436 hartree
xcener: -90.710099802837 hartree
chargesum: 0.0000000
charge: -0.129091 -0.323697 -0.381028 -0.012981 0.047739 -0.074287 -0.068736 -0.200001 0.006443 0.235772 -0.042279 -0.035773 -0.296816 -0.240950 -0.146425 -0.091192 -0.112021 0.112581 0.101274 0.108950 0.079549 0.106909 0.108305 0.101254 0.101640 0.089722 0.092392 0.111395 0.086002 0.125693 0.128866 0.145979 0.081214 0.077039 0.106558
qa: -0.1291 -0.3237 -0.3810 -0.0130 0.0477 -0.0743 -0.0687 -0.2000 0.0064 0.2358 -0.0423 -0.0358 -0.2968 -0.2409 -0.1464 -0.0912 -0.1120 0.1126 0.1013 0.1089 0.0795 0.1069 0.1083 0.1013 0.1016 0.0897 0.0924 0.1114 0.0860 0.1257 0.1289 0.1460 0.0812 0.0770 0.1066
va: 1.1459 1.9633 2.1251 2.8910 3.6794 3.8400 3.8204 3.9385 3.8813 4.1584 3.8789 3.8665 3.9616 3.9597 4.0259 3.9592 3.9500 1.0098 1.0141 1.0093 0.9891 1.0108 1.0096 1.0165 0.9876 1.0130 1.0077 0.9969 0.9953 1.0009 1.0064 1.0068 0.9922 0.9882 0.9946
dispcorr: -0.018774077 hartree
energy: -1171.719685080654
dipole: 9.36589 -10.00063 -0.63474 -12.28843 11.48066 -0.80776 -2.97445 2.94051 -0.03394
magnitude: 1.02788 au
magnitude: 2.61266 debye
