program: Orca
programVersion: 5.0.2
elementType: Cl O O N C C C C C C C C C C C C C H H H H H H H H H H H H H H H H H H
charge: 0
multiplicity: 1
keywords: wb97x-d3
keywords: def2-TZVPP
keywords: def2/J RIJCOSX
keywords: DEFGRID2
keywords: scfconv7
keywords: smallprint printgap noloewdin
keywords: NOSOSCF
formula: C13H18ClNO2
InChI: InChI=1/C13H18ClNO2/c1-10-5-4-6-11(2)13(10)15(7-8-17-3)12(16)9-14/h4-6H,7-9H2,1-3H3
35 atoms
Cl -1.282649 2.986382 -0.403061
O  2.424397 -0.674788 -1.874504
O  1.562019 2.225985 1.116236
N  0.712949 0.220442 0.52647
C  -0.408053 -0.633826 0.317188
C  2.045999 -0.370957 0.548348
C  -1.022764 -0.718125 -0.933313
C  -0.862261 -1.3947 1.406423
C  2.896979 -0.107468 -0.686902
C  0.597697 1.526252 0.897305
C  -2.100322 -1.594175 -1.0732
C  -1.933664 -2.255297 1.22248
C  -0.599901 0.084854 -2.128015
C  -0.226226 -1.260332 2.759984
C  -2.549863 -2.358388 -0.015763
C  -0.807927 2.085023 1.061697
C  2.448751 -2.072882 -1.91019
H  1.926413 -1.443793 0.707973
H  2.592634 0.018672 1.409827
H  3.912724 -0.468521 -0.459502
H  2.967949 0.967134 -0.85585
H  -2.590902 -1.668597 -2.036306
H  -2.294356 -2.843839 2.056935
H  -1.457677 0.615128 -2.540844
H  0.166629 0.817627 -1.907085
H  -0.209818 -0.569426 -2.907525
H  0.817014 -1.57943 2.763288
H  -0.239993 -0.229626 3.119248
H  -0.752112 -1.867619 3.494982
H  -3.387713 -3.030122 -0.149398
H  -1.570277 1.332533 1.245975
H  -0.787779 2.794039 1.886077
H  1.689552 -2.533988 -1.267092
H  3.428899 -2.477031 -1.622784
H  2.244796 -2.379246 -2.935593
totalener: -1171.69945640 hartree
nucrepener: 1431.56630937 hartree
electener: -2603.26576577 hartree
oneelecener: -4446.81563067 hartree
twoeener: 1843.54986490 hartree
kineticenergy: 1167.87639529 hartree
xcener: -90.714093391218 hartree
chargesum: -0.0000000
charge: -0.123354 -0.321079 -0.384955 0.022115 0.036271 -0.110041 -0.139343 -0.162008 0.005293 0.250172 -0.043910 -0.022755 -0.292082 -0.241650 -0.152271 -0.099070 -0.121828 0.103234 0.111166 0.076578 0.108397 0.112986 0.108826 0.112820 0.092951 0.106174 0.095918 0.096430 0.092240 0.126337 0.127933 0.145092 0.080094 0.090917 0.112399
qa: -0.1234 -0.3211 -0.3850 0.0221 0.0363 -0.1100 -0.1393 -0.1620 0.0053 0.2502 -0.0439 -0.0228 -0.2921 -0.2417 -0.1523 -0.0991 -0.1218 0.1032 0.1112 0.0766 0.1084 0.1130 0.1088 0.1128 0.0930 0.1062 0.0959 0.0964 0.0922 0.1263 0.1279 0.1451 0.0801 0.0909 0.1124
va: 1.1444 1.9543 2.1247 2.9113 3.6358 3.8278 3.8646 3.9286 3.9093 4.1464 3.8734 3.8585 3.9528 3.9694 4.0089 3.9921 3.9302 0.9869 1.0255 1.0046 1.0116 1.0049 1.0101 0.9980 1.0203 0.9987 0.9972 0.9971 1.0078 1.0009 1.0045 1.0026 0.9742 0.9979 0.9947
dispcorr: -0.020555154 hartree
energy: -1171.720011553663
dipole: 7.56642 -7.98206 -0.41564 -18.25111 16.50531 -1.74580 0.62234 -0.15245 0.46989
magnitude: 1.85510 au
magnitude: 4.71528 debye
