program: Gaussian 09
title: 000055899
version: EM64L-G09RevD.01
frameworkgroup: C1[X(C6H11N3O)]
method: RPBEPBE
basis: SDD
operation: Freq
keyword: #p
keyword: freq=noraman
keyword: PBEPBE/SDD
title: #p freq=noraman PBEPBE/SDD
converged: YES YES NO NO
title: Mulliken charges:
elementType: O N N N C C C C C C H H H H H H H H H H H
charge: -0.255644 -0.124226 -0.321185 -0.362863 0.102459 -0.487194 -0.426876 -0.439586 0.191936 -0.602056 0.262323 0.231475 0.250383 0.235381 0.242792 0.220854 0.243150 0.301922 0.227396 0.278372 0.231185
chargesum: 0.00000
title: Mulliken charges with hydrogens summed into heavy atoms:
elementType: O N N N C C C C C C
charge: -0.255644 -0.124226 -0.070802 -0.060941 0.102459 0.006605 0.051297 0.024419 0.191936 0.134897
polarizability: 1.06826996e+02 -5.23434373e+00 8.26311632e+01 -4.78920878e+00 3.03457765e+00 6.77107379e+01
1716.lowfreq: -0.0005 -0.0004 0.0005 2.0290 5.8650 7.2985 24.4449 81.9285 90.5154
frequency: 24.3066 81.8720 90.4931 126.6128 156.3441 240.2128 290.3510 323.1079 355.4646 440.4218 491.1311 557.7653 591.0510 647.9163 682.2414 705.8948 793.8138 799.1730 848.8261 864.5468 906.2714 939.9814 951.3691 1034.0747 1061.5294 1072.4106 1121.0710 1129.7104 1138.0205 1142.3182 1177.0572 1207.0663 1226.2480 1263.0047 1280.6257 1300.2182 1308.5888 1329.3320 1418.5681 1448.4753 1455.1404 1458.1011 1474.1922 1486.1383 1518.3940 1614.7626 2982.6232 3014.4988 3026.0390 3031.2709 3064.5023 3075.0953 3096.4289 3110.4913 3111.3581 3255.5057 3555.1825
redmass: 4.3026 2.2178 1.0943 2.9178 2.6860 3.4455 4.1904 3.8183 4.2102 3.8866 5.0974 1.2188 1.9436 5.1180 6.2468 5.3003 3.4274 4.6683 1.9544 1.9672 2.6996 2.8976 2.7782 2.5862 1.9316 1.9187 1.3115 1.5951 1.5756 1.5126 1.3350 1.7281 1.3215 1.6094 1.7160 1.2950 1.5119 1.9306 1.1783 1.0942 1.0900 1.2329 1.0970 1.0454 1.5527 7.8396 1.0345 1.0584 1.0598 1.0640 1.1026 1.1029 1.1062 1.1048 1.0988 1.0762 1.0771
irintensity: 9.2676 1.4364 0.2171 0.3091 2.2813 1.1810 14.0303 6.5684 15.4607 16.7649 3.6625 105.9093 10.6494 1.1514 8.3798 2.8331 1.5112 15.6009 1.9452 3.3441 2.7616 17.4495 1.5022 4.9432 25.3048 9.8929 0.8561 17.2601 56.1133 11.1603 4.6698 43.6563 24.3850 9.5829 23.5247 1.1078 4.9689 3.6279 31.5434 16.5038 17.3895 54.9599 10.8954 16.4749 132.4863 148.1568 66.2423 26.0597 47.1081 10.9188 32.6538 14.2590 13.6392 19.3098 2.2692 15.1171 13.7509
temp: 298.150 k
press: 1.00000 atm
elementType: 8 7 7 7 6 6 6 6 6 6 1 1 1 1 1 1 1 1 1 1 1
symmnumber: 1
zpe: 453966.1 jmol-1
zpe.correction: 0.172907 hartree
zpe.thermalcorrener: 0.183124 hartree
zpe.thermalcorrenthalpy: 0.184068 hartree
zpe.thermalcorrgfe: 0.136211 hartree
zpe.sumelectzpe: -473.863366 hartree
zpe.sumelectthermal: -473.853149 hartree
zpe.sumelectthermalent: -473.852205 hartree
zpe.sumelectthermalfe: -473.900061 hartree
dipole: -0.9676 1.8232 1.9602
dipole: 2.8465
quadrupole: -46.9325 -63.3656 -62.8431
quadrupole: -8.5086 -2.9551 -1.5979
quadrupole: 10.7812 -5.6519 -5.1294 -8.5086 -2.9551 -1.5979
hfenergy: -474.0362726 hartree
pointgroup: C01 [X(C6H11N3O1)]
dipole: 0.3680767 -0.2872399 1.0179413 debye
dipolederiv: -0.7024816 -0.1039334 0.1021077 0.1048534 -0.614452 0.2898584 -0.0937259 0.3317364 -0.7110072 -0.2234831 0.0034202 0.0510559 0.0341148 -0.2113749 -0.0276192 -0.0254971 -0.1359326 -0.1573107 -0.2254461 -0.0849189 -0.0641741 -0.0899669 -0.2465726 0.1066508 -0.0753635 0.2365699 -0.4402909 -1.0122951 0.2183631 -0.2579994 0.1676498 -0.5220319 0.0426411 -0.1846042 0.0400794 -0.4452037 0.0144912 -0.141987 -0.0183886 -0.0816404 0.2712961 0.01923 -0.0235405 -0.0318478 0.1914489 -0.0756591 0.0197784 -0.033241 0.0049013 -0.0502614 -0.0118522 -0.0525247 -0.022839 0.0829933 0.2084197 0.0483205 0.0816411 -0.0618113 0.1480906 -0.0314019 0.0513238 -0.003836 0.1982108 0.0491845 -0.0437928 -0.0552213 0.0085981 -0.0311703 -0.0370051 0.0188828 -0.0667796 0.1139851 1.3067518 -0.0772627 0.1538321 -0.279187 0.5402082 -0.5090222 0.37631 -0.4912782 0.7452231 0.4645498 -0.0273034 0.024619 0.0985891 0.1735206 0.1227509 -0.1691708 0.1375483 0.0860461 0.0621708 -0.0907961 -0.0005307 -0.0840576 -0.0447156 0.0114817 -0.0066311 0.0529238 0.0795134 0.0348907 0.0355432 0.0265121 -0.0057148 0.0828935 0.006679 0.0203016 -0.0481188 -0.1095282 -0.0146138 0.1896942 -0.0144408 0.1536453 0.1022014 -0.0440933 0.0116569 -0.0577406 0.1734538 -0.0307911 -0.0399105 0.0307353 -0.0165519 0.0174663 0.0581773 0.1203624 0.0873324 0.0033612 0.0087865 -0.0192056 -0.0688922 -0.0150845 0.0378834 -0.0527966 -0.1117526 -0.0790666 -0.0632321 -0.1282756 0.1033192 0.0478976 0.0946293 0.0341164 -0.0236877 0.0753306 -0.0421531 0.059978 0.0805185 -0.0386373 0.030045 -0.0044518 0.0196465 0.0580992 -0.0267947 0.0860952 -0.1049323 0.1762201 -0.0123418 0.0646327 -0.0045058 0.242895 0.1042469 0.0820491 0.1007792 0.1728258 -0.0947801 -0.029361 -0.0703188 -0.0880669 0.0653569 -0.0948976 -0.1057639 -0.1039233 -0.0269201 0.1586032 0.0274857 -0.040727 -0.0596195 0.0855894 0.072333 0.070288 0.0594856 0.0328354 -0.0567614 0.0635259 0.0108555 0.1236773 -0.1005856 -0.0597723 0.0488638 -0.0490345 0.1185502 unknown
polarizability: 106.6440103|-2.705958|77.0664682|6.8807648|-7.9400346|73.4584182 unknown
InChI: InChI=1S/C6H11N3O/c1-7-5(10)6-3-2-4-9(6)8-6/h7-8H,2-4H2,1H3
charge 0 multiplicity 1
21 atoms
O  1.280474 1.158798 -1.105206
N  -1.037115 -1.022649 -0.231676
N  -0.635704 -1.060994 1.312353
N  2.166267 -0.221091 0.556041
C  -0.275945 0.107134 0.430635
C  -1.194983 1.318247 0.644779
C  -2.478974 -0.550115 -0.319876
C  -2.455209 0.997429 -0.216569
C  1.118556 0.385949 -0.112905
C  3.562628 -0.060052 0.132479
H  -0.704432 2.247614 0.31698
H  -1.448875 1.394699 1.716048
H  0.130755 -1.772663 1.316272
H  -3.051976 -1.013367 0.501718
H  -2.871703 -0.911034 -1.285146
H  -3.381965 1.402187 0.225803
H  -2.33195 1.438116 -1.221722
H  1.968644 -0.759637 1.400559
H  4.163137 0.442256 0.91312
H  3.561497 0.566272 -0.773875
H  4.022574 -1.036598 -0.104511
