program: Orca
programVersion: 5.0.2
elementType: Cl O O N C C C C C C C C C C C C C H H H H H H H H H H H H H H H H H H
charge: 0
multiplicity: 1
keywords: wb97x-d3
keywords: def2-TZVPP
keywords: def2/J RIJCOSX
keywords: DEFGRID2
keywords: scfconv7
keywords: smallprint printgap noloewdin
keywords: NOSOSCF
formula: C13H18ClNO2
InChI: InChI=1/C13H18ClNO2/c1-10-5-4-6-11(2)13(10)15(7-8-17-3)12(16)9-14/h4-6H,7-9H2,1-3H3
35 atoms
Cl -0.440661 1.983454 2.198021
O  3.041459 -0.766279 0.334535
O  1.466343 2.176857 -0.568369
N  0.36143 0.199189 -0.666698
C  -0.822354 -0.556772 -0.421515
C  1.399935 -0.425097 -1.47427
C  -1.82117 -0.543526 -1.408805
C  -0.969107 -1.305649 0.747138
C  2.329027 -1.358811 -0.706434
C  0.491775 1.506706 -0.30704
C  -2.969082 -1.294426 -1.210287
C  -2.143064 -2.042875 0.90905
C  -1.675844 0.298965 -2.642706
C  0.062104 -1.364153 1.836182
C  -3.130549 -2.043686 -0.054264
C  -0.678478 2.135785 0.436091
C  4.084784 0.081567 -0.072599
H  1.961521 0.360844 -1.978015
H  0.917677 -1.022471 -2.253168
H  3.005653 -1.821461 -1.443163
H  1.74473 -2.170323 -0.265791
H  -3.747073 -1.287823 -1.963534
H  -2.273398 -2.624496 1.8137
H  -1.59446 1.361921 -2.405402
H  -0.790082 0.041449 -3.225016
H  -2.539459 0.178974 -3.29509
H  0.43872 -2.382912 1.945352
H  0.913753 -0.714099 1.666078
H  -0.382079 -1.081028 2.790192
H  -4.031676 -2.624453 0.092882
H  -0.688635 3.196911 0.199978
H  -1.645224 1.698181 0.199295
H  3.727293 0.992861 -0.558037
H  4.781464 -0.429672 -0.750017
H  4.633739 0.370431 0.822544
totalener: -1171.70113265 hartree
nucrepener: 1431.82938850 hartree
electener: -2603.53052115 hartree
oneelecener: -4447.50081802 hartree
twoeener: 1843.97029687 hartree
kineticenergy: 1167.86798822 hartree
xcener: -90.714320492365 hartree
chargesum: -0.0000000
charge: -0.124455 -0.322945 -0.395015 0.021084 0.076891 -0.092506 -0.195431 -0.137232 0.009473 0.265627 -0.021421 -0.056152 -0.236367 -0.331868 -0.149585 -0.095688 -0.112297 0.117566 0.097553 0.081644 0.093070 0.108916 0.112640 0.091190 0.095122 0.091121 0.108437 0.110672 0.110132 0.126189 0.145314 0.127237 0.102033 0.073208 0.105840
qa: -0.1245 -0.3229 -0.3950 0.0211 0.0769 -0.0925 -0.1954 -0.1372 0.0095 0.2656 -0.0214 -0.0562 -0.2364 -0.3319 -0.1496 -0.0957 -0.1123 0.1176 0.0976 0.0816 0.0931 0.1089 0.1126 0.0912 0.0951 0.0911 0.1084 0.1107 0.1101 0.1262 0.1453 0.1272 0.1020 0.0732 0.1058
va: 1.1446 1.9631 2.1116 2.9180 3.6581 3.7991 3.9469 3.8407 3.9265 4.1235 3.8483 3.8920 3.9782 3.9221 4.0167 3.9806 3.9135 1.0129 1.0124 1.0048 0.9884 1.0097 1.0058 0.9973 0.9993 1.0079 0.9947 1.0348 1.0004 1.0010 1.0038 1.0043 0.9960 0.9929 0.9971
dispcorr: -0.020041440 hartree
energy: -1171.721174087029
dipole: 5.07079 -5.88802 -0.81723 -10.38795 9.44982 -0.93812 -11.25716 10.30804 -0.94912
magnitude: 1.56485 au
magnitude: 3.97754 debye
