program: Orca
programVersion: 5.0.2
elementType: Cl O O N C C C C C C C C C C C C C H H H H H H H H H H H H H H H H H H
charge: 0
multiplicity: 1
keywords: wb97x-d3
keywords: def2-TZVPP
keywords: def2/J RIJCOSX
keywords: DEFGRID2
keywords: scfconv7
keywords: smallprint printgap noloewdin
keywords: NOSOSCF
formula: C13H18ClNO2
InChI: InChI=1/C13H18ClNO2/c1-10-5-4-6-11(2)13(10)15(7-8-17-3)12(16)9-14/h4-6H,7-9H2,1-3H3
35 atoms
Cl -2.036219 2.647674 0.160953
O  2.600084 -1.621608 -0.201509
O  1.350772 2.811685 0.314312
N  0.729188 0.683788 -0.113784
C  -0.220887 -0.36741 0.016199
C  1.904363 0.52225 -0.972528
C  -1.111536 -0.616742 -1.031634
C  -0.222028 -1.149703 1.177133
C  2.210267 -0.911179 -1.340171
C  0.553083 1.910639 0.450822
C  -2.01705 -1.66415 -0.897679
C  -1.149774 -2.180407 1.276643
C  -1.089478 0.201381 -2.288785
C  0.726887 -0.879681 2.30704
C  -2.039468 -2.4396 0.247657
C  -0.718589 2.137137 1.256048
C  2.614315 -3.007115 -0.390999
H  2.767778 0.953393 -0.464537
H  1.772591 1.093761 -1.896546
H  3.015995 -0.891453 -2.089702
H  1.347686 -1.388264 -1.8262
H  -2.716107 -1.866117 -1.699733
H  -1.169353 -2.790489 2.171272
H  -2.010637 0.064936 -2.853226
H  -0.981841 1.265072 -2.085354
H  -0.266457 -0.091649 -2.945102
H  0.736557 -1.714427 3.006497
H  1.742942 -0.725832 1.951869
H  0.442993 0.006588 2.879953
H  -2.753505 -3.24742 0.340686
H  -1.074505 1.264917 1.796503
H  -0.536023 2.952422 1.951073
H  3.325833 -3.314988 -1.168265
H  1.623773 -3.39291 -0.662687
H  2.916126 -3.468818 0.548007
totalener: -1171.70145316 hartree
nucrepener: 1444.76274314 hartree
electener: -2616.46419630 hartree
oneelecener: -4473.19510103 hartree
twoeener: 1856.73090473 hartree
kineticenergy: 1167.87380068 hartree
xcener: -90.715740491898 hartree
chargesum: -0.0000000
charge: -0.130448 -0.320573 -0.378247 -0.010034 0.191087 -0.061025 -0.232869 -0.245122 -0.013905 0.255003 -0.010424 -0.006717 -0.259651 -0.259889 -0.172994 -0.098114 -0.113786 0.114361 0.099380 0.093571 0.082081 0.106864 0.107287 0.092937 0.109860 0.082570 0.085904 0.119481 0.087914 0.124839 0.125606 0.148129 0.094354 0.085674 0.106898
qa: -0.1304 -0.3206 -0.3782 -0.0100 0.1911 -0.0610 -0.2329 -0.2451 -0.0139 0.2550 -0.0104 -0.0067 -0.2597 -0.2599 -0.1730 -0.0981 -0.1138 0.1144 0.0994 0.0936 0.0821 0.1069 0.1073 0.0929 0.1099 0.0826 0.0859 0.1195 0.0879 0.1248 0.1256 0.1481 0.0944 0.0857 0.1069
va: 1.1449 1.9606 2.1343 2.9371 3.4044 3.8473 3.8861 3.8772 3.9730 4.1360 3.8517 3.8181 3.9476 3.9515 4.0470 3.9748 3.9220 1.0211 1.0041 1.0020 0.9841 1.0087 1.0081 1.0092 1.0172 0.9961 1.0070 1.0141 0.9977 1.0011 1.0088 1.0053 0.9929 0.9898 0.9945
dispcorr: -0.020827621 hartree
energy: -1171.722280779564
dipole: 10.30536 -10.45925 -0.15390 -18.22214 16.43298 -1.78916 -3.10645 2.91535 -0.19111
magnitude: 1.80591 au
magnitude: 4.59025 debye
