program: Gaussian 09
title: 000055897
version: EM64L-G09RevD.01
frameworkgroup: C1[X(C9H10OS2)]
method: RPBEPBE
basis: SDD
operation: Freq
keyword: #p
keyword: freq=noraman
keyword: PBEPBE/SDD
title: #p freq=noraman PBEPBE/SDD
converged: NO YES NO NO
title: Mulliken charges:
elementType: S S O C C C C C C C C C H H H H H H H H H H
charge: 0.676604 0.224340 -0.610267 -0.890803 -0.580010 -0.636545 0.549987 -0.381232 -0.360493 -0.221222 -0.219104 -0.235242 0.357312 0.275700 0.294508 0.279539 0.275635 0.255943 0.253695 0.231670 0.228233 0.231751
chargesum: 0.00000
title: Mulliken charges with hydrogens summed into heavy atoms:
elementType: S S O C C C C C C C C C
charge: 0.676604 0.224340 -0.610267 -0.533491 -0.009802 -0.081370 0.549987 -0.125288 -0.106798 0.010447 0.009129 -0.003491
polarizability: 1.96969952e+02 3.20675127e+00 1.37084202e+02 -1.25610297e+00 1.24393464e+01 8.46401212e+01
1716.lowfreq: -10.1473 -4.9953 -0.0005 0.0020 0.0026 4.8695 36.9604 50.7870 76.2544
frequency: 36.6478 50.7557 76.2486 132.2463 152.0268 188.1058 240.4940 260.2302 281.3265 335.0109 391.7131 402.2963 454.3467 550.8333 577.5451 585.9612 612.9209 615.7574 699.0149 728.1923 778.3532 809.2032 814.6140 835.2049 853.5726 927.7495 935.6145 981.4737 988.0749 999.5651 1027.1878 1029.4090 1075.0731 1083.3188 1124.4687 1133.0432 1173.6384 1190.9991 1197.2131 1240.1297 1246.9312 1275.2450 1330.0905 1384.8657 1421.9706 1439.3270 1454.4549 1480.2613 1586.8749 1608.5529 3034.7230 3041.7964 3050.0513 3106.8243 3126.7690 3128.3808 3134.0943 3144.0578 3153.5963 3167.4883
redmass: 4.3054 4.2128 6.8837 2.5504 6.4739 6.6131 6.5703 6.4137 4.7302 8.8387 5.5948 2.8314 4.5425 6.8556 6.3976 4.0580 6.3652 3.2517 1.7442 6.2183 1.8642 4.1221 2.1305 4.6925 1.2503 1.4050 1.4810 1.4834 4.7827 1.3228 2.1684 2.3763 1.0569 1.6037 1.1092 1.3600 1.0635 1.1203 1.3822 1.2336 2.4692 1.1908 1.2695 7.6581 1.1023 2.1912 1.0975 2.2523 5.9250 5.9880 1.0545 1.0595 1.0877 1.1090 1.0849 1.1095 1.0878 1.0924 1.0967 1.1017
irintensity: 0.8246 6.4683 2.8826 0.9788 4.3129 3.7628 3.1114 1.8712 5.1222 1.1083 1.6754 0.2522 5.2498 4.4346 7.5141 8.3267 0.7972 2.1745 43.4030 12.9096 46.1499 26.4447 40.4838 6.5824 0.1102 2.2298 5.3474 0.0818 0.5167 0.0645 4.9621 3.0405 1.8866 8.3332 16.4383 5.6609 0.3379 2.8567 0.4645 0.2595 17.5636 7.3783 2.3570 0.0632 16.7005 11.9976 4.9073 13.6106 1.3372 1.3094 6.1724 23.2368 3.4043 3.4015 1.2329 5.5353 2.5167 12.4448 24.3156 24.4341
temp: 298.150 k
press: 1.00000 atm
elementType: 16 16 8 6 6 6 6 6 6 6 6 6 1 1 1 1 1 1 1 1 1 1
symmnumber: 1
zpe: 435954.7 jmol-1
zpe.correction: 0.166046 hartree
zpe.thermalcorrener: 0.177865 hartree
zpe.thermalcorrenthalpy: 0.178809 hartree
zpe.thermalcorrgfe: 0.126783 hartree
zpe.sumelectzpe: -1219.338884 hartree
zpe.sumelectthermal: -1219.327066 hartree
zpe.sumelectthermalent: -1219.326122 hartree
zpe.sumelectthermalfe: -1219.378147 hartree
dipole: -1.2450 -2.8253 -0.5485
dipole: 3.1358
quadrupole: -65.3218 -98.6388 -84.9278
quadrupole: 5.5188 0.5509 5.0694
quadrupole: 17.6410 -15.6760 -1.9650 5.5188 0.5509 5.0694
hfenergy: -1219.5049308 hartree
pointgroup: C01 [X(C9H10O1S2)]
dipole: 0.4488663 1.0966735 -0.3433543 debye
dipolederiv: 0.2034207 0.0382363 0.0548287 -0.0436812 0.7376644 0.1949169 0.1123424 -0.0355063 0.1804101 -0.2312327 -0.0605108 0.0049051 -0.105556 -0.1738822 -0.0172034 0.0437042 -0.0751552 -0.1421258 -0.3781062 0.0602872 -0.0586457 0.0578256 -0.7701779 -0.2532401 -0.0565602 0.2536414 -0.3223183 0.4819534 0.1508404 -0.0356762 0.3082607 0.277165 0.0286703 0.0181489 -0.0666441 0.0769652 -0.1514566 -0.0196545 0.0117333 0.0002862 -0.0656972 0.0447955 0.0895967 -0.059455 0.0252804 0.1839137 -0.0919138 -0.0574745 -0.0666312 -0.0220754 0.0165702 -0.1823621 0.0168355 0.156861 0.1237609 -0.0491728 -0.007596 -0.0983526 -0.128603 -0.0002035 0.0189464 -0.0156963 -0.0319699 -0.0953628 -0.0579391 0.0908145 -0.0310098 -0.0332177 -0.0821493 -0.0480099 -0.0572604 -0.0530041 -0.0914834 0.0896828 -0.0291822 0.0213942 -0.0483165 -0.0711024 -0.0009676 -0.02363 -0.0900204 -0.0242844 0.1085645 -0.0581409 0.1212821 0.0110078 -0.1082494 -0.0610649 -0.0747829 -0.061935 -0.0562011 -0.0681475 0.0891326 -0.1096611 -0.0109425 -0.116414 0.1042382 -0.1257977 -0.0095498 0.0486375 0.0511525 0.0500128 0.0358956 -0.0849335 -0.0497588 0.0338469 -0.0532724 -0.0926867 -0.0299463 0.0094373 -0.0090597 0.0214747 -0.1157442 0.0669409 -0.0182753 -0.044131 -0.015178 -0.0392104 0.0452102 0.0487601 0.0661647 0.039126 -0.0366946 0.035744 -0.0279397 0.0704024 0.0694408 -0.0603446 0.0190968 -0.0328978 0.0183492 0.0183418 -0.0454389 0.02882 -0.0404992 -0.0548531 -0.0374644 -0.0423407 -0.0920586 0.0072021 -0.046252 -0.0452444 -0.0433173 0.056619 -0.0105202 -0.0171257 0.041797 0.0445819 0.0723587 0.0163917 0.0921784 0.0714523 -0.075655 0.0617978 0.0507733 -0.0803802 0.0385817 0.067127 0.0759052 -0.0584528 0.0519143 0.0566623 0.0866266 -0.0773704 0.0428759 -0.059053 0.0457316 0.0732659 0.0632976 0.0446832 0.0846188 0.0053644 -0.0786222 0.040622 -0.105291 0.0211505 0.100248 0.046302 0.0966818 0.0766106 0.0268382 0.041676 -0.0682583 0.0575332 0.0394795 0.1162856 -0.092873 0.1143668 0.0309755 -0.1290966 -0.0275947 -0.0478246 -0.0290883 0.1172284 0.0289354 -0.0490966 0.0241932 0.1195369 unknown
polarizability: 196.6137242|5.795267|133.8246047|1.8126168|-18.1321876|88.255946 unknown
InChI: InChI=1S/C9H10OS2/c10-12-7-6-11-9(12)8-4-2-1-3-5-8/h1-5,9H,6-7H2
charge 0 multiplicity 1
22 atoms
S  1.730311 -1.050502 -0.654562
S  1.550503 1.959359 0.206499
O  1.628322 -2.450029 0.247794
C  0.732316 0.304334 0.497835
C  3.387139 -0.209929 -0.046998
C  3.3009 1.298046 -0.242001
C  -0.733584 0.243772 0.209296
C  -1.503597 -0.741284 0.88855
C  -1.370586 1.080355 -0.746123
C  -2.881189 -0.883433 0.617905
C  -2.749811 0.940039 -1.007662
C  -3.51021 -0.04091 -0.327718
H  0.989326 -0.115261 1.485007
H  4.194564 -0.671372 -0.638221
H  3.451901 -0.529653 1.005975
H  4.01251 1.820603 0.41741
H  3.4866 1.592268 -1.286686
H  -1.015753 -1.399383 1.616239
H  -0.782995 1.840354 -1.273016
H  -3.462038 -1.648927 1.143842
H  -3.233393 1.595611 -1.740461
H  -4.581438 -0.146155 -0.532503
