program: Orca
programVersion: 5.0.2
elementType: S O N C C C C C C C C C C C C C C C H H H H H H H H H H H H H H H H H H H H H
charge: 0
multiplicity: 1
keywords: wb97x-d3
keywords: def2-TZVPP
keywords: def2/J RIJCOSX
keywords: DEFGRID2
keywords: scfconv7
keywords: smallprint printgap noloewdin
keywords: NOSOSCF
formula: C15H21NOS
InChI: InChI=1/C15H21NOS/c1-15(2,13-9-5-3-6-10-13)18-14(17)16-11-7-4-8-12-16/h3,5-6,9-10H,4,7-8,11-12H2,1-2H3
39 atoms
S  0.016729 -1.709494 -0.370551
O  0.229166 -0.080075 1.694888
N  2.184773 -0.581777 0.671269
C  3.932621 1.248482 -0.701098
C  3.199485 0.131335 -1.438383
C  3.200672 1.641445 0.578824
C  2.916409 -1.035846 -0.502661
C  2.923163 0.415837 1.440067
C  -1.774097 -1.352928 -0.071886
C  0.846438 -0.657388 0.819983
C  -2.037636 0.14119 -0.158094
C  -2.46809 -2.057661 -1.244434
C  -2.237525 -2.006336 1.224132
C  -2.802975 0.805228 0.795443
C  -1.55662 0.878042 -1.241828
C  -3.070958 2.164535 0.678534
C  -1.819554 2.233743 -1.359841
C  -2.577992 2.88699 -0.396392
H  4.942047 0.908423 -0.447148
H  4.052525 2.116477 -1.352138
H  2.251996 0.50232 -1.842261
H  3.790553 -0.221928 -2.286396
H  3.790647 2.359511 1.15263
H  2.251479 2.129945 0.337159
H  2.384476 -1.835606 -1.014173
H  3.855467 -1.473686 -0.153822
H  3.863294 -0.04095 1.760264
H  2.370132 0.675112 2.338296
H  -3.545098 -1.907074 -1.162062
H  -2.283416 -3.133361 -1.228192
H  -2.151848 -1.671991 -2.213304
H  -3.32193 -1.926038 1.323988
H  -1.781128 -1.567545 2.108463
H  -1.993856 -3.068449 1.210544
H  -3.195999 0.273436 1.651393
H  -0.954767 0.39333 -2.000889
H  -3.664091 2.657158 1.438789
H  -1.425795 2.782628 -2.206324
H  -2.779407 3.947182 -0.48407
elementType: S O N C H
totalener: -1112.53202317 hartree
nucrepener: 1529.42396534 hartree
electener: -2641.95598851 hartree
oneelecener: -4558.68639391 hartree
twoeener: 1916.73040540 hartree
cpcmener: -0.02063923 hartree
kineticenergy: 1108.49319242 hartree
xcener: -90.839603884588 hartree
chargesum: 0.0000000
charge: -0.186818 -0.505341 -0.106304 -0.112834 -0.118071 -0.123662 -0.103601 -0.085976 0.419348 0.301647 -0.039235 -0.315078 -0.361824 -0.196556 -0.228261 -0.153475 -0.176082 -0.165048 0.072004 0.076548 0.066066 0.077848 0.078282 0.073039 0.109479 0.105195 0.104481 0.099501 0.111607 0.111274 0.112507 0.105161 0.114716 0.103557 0.140835 0.130218 0.154132 0.154204 0.156517
qa: -0.1868 -0.5053 -0.1063 -0.1128 -0.1181 -0.1237 -0.1036 -0.0860 0.4193 0.3016 -0.0392 -0.3151 -0.3618 -0.1966 -0.2283 -0.1535 -0.1761 -0.1650 0.0720 0.0765 0.0661 0.0778 0.0783 0.0730 0.1095 0.1052 0.1045 0.0995 0.1116 0.1113 0.1125 0.1052 0.1147 0.1036 0.1408 0.1302 0.1541 0.1542 0.1565
va: 2.3391 1.9986 3.1667 3.8786 3.8925 3.9000 3.9247 3.8774 3.6103 4.2963 3.5764 3.9085 3.9355 3.9284 3.9690 3.9241 3.9414 3.9042 1.0103 1.0124 1.0176 1.0180 1.0160 1.0142 1.0094 1.0035 1.0028 1.0336 1.0013 1.0062 1.0045 0.9979 1.0150 1.0127 1.0020 1.0230 0.9931 0.9925 0.9901
dispcorr: -0.019350896 hartree
energy: -1112.551374065600
dipole: 5.96980 -4.97099 0.99881 1.60399 -1.72406 -0.12008 -3.03413 2.04807 -0.98606
magnitude: 1.40867 au
magnitude: 3.58056 debye
