program: Orca
programVersion: 5.0.2
elementType: S O N C C C C C C C C C C C C C C C H H H H H H H H H H H H H H H H H H H H H
charge: 0
multiplicity: 1
keywords: wb97x-d3
keywords: def2-TZVPP
keywords: def2/J RIJCOSX
keywords: DEFGRID2
keywords: scfconv7
keywords: smallprint printgap noloewdin
keywords: NOSOSCF
formula: C15H21NOS
InChI: InChI=1/C15H21NOS/c1-15(2,13-9-5-3-6-10-13)18-14(17)16-11-7-4-8-12-16/h3,5-6,9-10H,4,7-8,11-12H2,1-2H3
39 atoms
S  0.034824 -1.372557 1.110824
O  0.219872 -0.850738 -1.468505
N  2.195498 -0.877474 -0.359592
C  3.875499 1.426703 0.003179
C  3.148899 1.15859 -1.313051
C  3.168144 0.75486 1.178087
C  2.911104 -0.335199 -1.505333
C  2.924527 -0.720733 0.884817
C  -1.747832 -1.169998 0.680253
C  0.843259 -0.981192 -0.443951
C  -2.004813 0.215179 0.112098
C  -2.206689 -2.317497 -0.212508
C  -2.4521 -1.296073 2.037864
C  -2.730078 0.405975 -1.056979
C  -1.563706 1.344547 0.801167
C  -3.014063 1.682756 -1.521828
C  -1.841622 2.619222 0.338992
C  -2.572547 2.795549 -0.827447
H  4.899101 1.042291 -0.066031
H  3.961979 2.500926 0.178177
H  2.183015 1.671595 -1.323826
H  3.725698 1.551722 -2.153429
H  3.759878 0.85678 2.090666
H  2.204594 1.237455 1.367606
H  2.347853 -0.537358 -2.412257
H  3.866614 -0.863575 -1.585262
H  3.87883 -1.246681 0.779112
H  2.401378 -1.206922 1.706346
H  -3.290802 -2.286614 -0.342678
H  -1.962072 -3.268943 0.258395
H  -1.738019 -2.29191 -1.192096
H  -3.528026 -1.191991 1.89159
H  -2.137061 -0.527395 2.742328
H  -2.265042 -2.271021 2.490853
H  -3.071506 -0.44245 -1.632258
H  -0.977784 1.225956 1.704435
H  -3.576521 1.80255 -2.43862
H  -1.485019 3.478876 0.891407
H  -2.790826 3.790874 -1.191514
totalener: -1112.51180328 hartree
nucrepener: 1533.04442978 hartree
electener: -2645.55623306 hartree
oneelecener: -4565.07123892 hartree
twoeener: 1919.51500587 hartree
kineticenergy: 1108.54288847 hartree
xcener: -90.844727471989 hartree
chargesum: 0.0000000
charge: -0.180388 -0.411539 -0.113099 -0.114751 -0.132738 -0.116908 -0.087905 -0.117393 0.373530 0.292687 -0.027487 -0.353201 -0.301947 -0.130218 -0.212052 -0.122705 -0.147298 -0.126740 0.066429 0.075491 0.083058 0.072769 0.071257 0.067313 0.105728 0.090346 0.092748 0.105041 0.090697 0.096482 0.126061 0.102700 0.105398 0.103317 0.108475 0.106222 0.118944 0.119809 0.121866
qa: -0.1804 -0.4115 -0.1131 -0.1148 -0.1327 -0.1169 -0.0879 -0.1174 0.3735 0.2927 -0.0275 -0.3532 -0.3019 -0.1302 -0.2121 -0.1227 -0.1473 -0.1267 0.0664 0.0755 0.0831 0.0728 0.0713 0.0673 0.1057 0.0903 0.0927 0.1050 0.0907 0.0965 0.1261 0.1027 0.1054 0.1033 0.1085 0.1062 0.1189 0.1198 0.1219
va: 2.3368 2.0913 3.1377 3.8683 3.8914 3.8792 3.8948 3.9451 3.7059 4.2904 3.6591 3.9277 3.9124 3.9735 4.0186 3.9917 4.0032 3.9640 1.0118 1.0141 1.0147 1.0174 1.0198 1.0202 1.0346 1.0034 1.0047 1.0148 1.0004 1.0169 1.0142 1.0048 1.0077 1.0090 1.0109 1.0293 1.0029 1.0018 0.9997
dispcorr: -0.019419130 hartree
energy: -1112.531222413709
dipole: 5.82537 -5.11917 0.70620 2.84486 -2.56960 0.27526 1.69427 -1.23444 0.45983
magnitude: 0.88652 au
magnitude: 2.25336 debye
