program: Orca
programVersion: 5.0.2
elementType: S O O O N N N N C C C C C C C C C C C C C C C C H H H H H H H H H H H H H H H H H H H H H H
charge: 0
multiplicity: 1
keywords: wb97x-d3
keywords: def2-TZVPP
keywords: def2/J RIJCOSX
keywords: DEFGRID2
keywords: scfconv7
keywords: smallprint printgap noloewdin
keywords: NOSOSCF
formula: C16H22N4O3S
InChI: InChI=1/C16H22N4O3S/c1-6-19(7-2)16(21)20-10-17-15(18-20)24(22,23)14-12(4)8-11(3)9-13(14)5/h8-10H,6-7H2,1-5H3
46 atoms
S  1.151513 1.660739 0.746328
O  1.548946 2.183752 2.042695
O  0.751741 2.610638 -0.280011
O  -4.184745 -0.786617 1.682535
N  -3.973658 -0.08024 -0.470794
N  -2.122455 -0.191442 0.992444
N  -1.381921 0.780433 0.458704
N  -0.181056 -0.407031 1.938358
C  2.363588 0.520324 0.114242
C  2.193761 0.041626 -1.199933
C  3.433787 0.088783 0.923882
C  4.20806 -1.296018 -0.928879
C  3.130042 -0.864153 -1.686043
C  4.336316 -0.807853 0.363998
C  -0.239588 0.603006 1.053922
C  1.080968 0.424398 -2.137812
C  3.698808 0.493552 2.348834
C  -5.423069 -0.133425 -0.66603
C  -3.152309 -0.010067 -1.687116
C  -3.52581 -0.380743 0.747852
C  5.192207 -2.28556 -1.468716
C  -1.392502 -0.886751 1.889074
C  -5.925111 -1.494297 -1.113542
C  -2.408216 -1.293885 -2.011986
H  3.006717 -1.241994 -2.694176
H  5.169237 -1.143952 0.97064
H  -5.914792 0.169155 0.25667
H  -5.669669 0.623242 -1.41157
H  -3.846689 0.211055 -2.496228
H  -2.469964 0.835279 -1.637334
H  0.091586 0.38778 -1.68571
H  1.219803 1.427253 -2.540076
H  1.070525 -0.265606 -2.980134
H  2.859049 0.277016 3.007191
H  4.556165 -0.065095 2.720317
H  3.934686 1.551659 2.445342
H  6.217634 -1.989518 -1.244998
H  5.038083 -3.267635 -1.01642
H  5.098949 -2.401019 -2.547679
H  -1.778892 -1.721787 2.451456
H  -5.506303 -1.783959 -2.077987
H  -5.683721 -2.270557 -0.386871
H  -7.010029 -1.465521 -1.222726
H  -3.090417 -2.141822 -2.081164
H  -1.912346 -1.185222 -2.977379
H  -1.638586 -1.540385 -1.280163
elementType: S O N C H
totalener: -1465.94631500 hartree
nucrepener: 2375.17522592 hartree
electener: -3841.12154092 hartree
oneelecener: -6724.38336493 hartree
twoeener: 2883.26182401 hartree
cpcmener: -0.03877212 hartree
kineticenergy: 1460.48672857 hartree
xcener: -121.652487173521 hartree
chargesum: -0.0000000
charge: 0.872513 -0.529821 -0.527447 -0.480721 -0.130081 0.114790 -0.283231 -0.370598 -0.300334 0.147690 0.175471 0.070803 -0.225497 -0.228582 0.114581 -0.212443 -0.197258 -0.021171 -0.077925 0.390682 -0.209523 0.120640 -0.265175 -0.276756 0.122689 0.120916 0.093066 0.096441 0.108914 0.127155 0.076711 0.121608 0.098213 0.099606 0.089267 0.106617 0.103650 0.108902 0.094619 0.181495 0.088049 0.090043 0.101362 0.106644 0.103378 0.090048
qa: 0.8725 -0.5298 -0.5274 -0.4807 -0.1301 0.1148 -0.2832 -0.3706 -0.3003 0.1477 0.1755 0.0708 -0.2255 -0.2286 0.1146 -0.2124 -0.1973 -0.0212 -0.0779 0.3907 -0.2095 0.1206 -0.2652 -0.2768 0.1227 0.1209 0.0931 0.0964 0.1089 0.1272 0.0767 0.1216 0.0982 0.0996 0.0893 0.1066 0.1036 0.1089 0.0946 0.1815 0.0880 0.0900 0.1014 0.1066 0.1034 0.0900
va: 5.5936 1.9576 1.9525 2.0324 3.2113 3.3231 2.8856 3.0669 3.6916 3.6456 3.6065 3.7145 3.9924 3.9838 4.0792 3.8919 3.8552 3.8575 3.8426 4.2674 3.8963 4.0320 3.9149 3.9226 1.0113 1.0113 1.0141 1.0008 0.9937 1.0067 0.9908 1.0039 1.0058 1.0123 1.0045 1.0041 0.9980 0.9941 1.0053 0.9952 1.0011 1.0076 1.0075 1.0042 1.0067 0.9976
dispcorr: -0.025277443 hartree
energy: -1465.971592445639
dipole: -5.03835 4.60417 -0.43417 -16.77651 13.80973 -2.96678 -19.35625 16.58465 -2.77160
magnitude: 4.08314 au
magnitude: 10.37852 debye
