program: Orca
programVersion: 5.0.2
elementType: S O O O N N N N C C C C C C C C C C C C C C C C H H H H H H H H H H H H H H H H H H H H H H
charge: 0
multiplicity: 1
keywords: wb97x-d3
keywords: def2-TZVPP
keywords: def2/J RIJCOSX
keywords: DEFGRID2
keywords: scfconv7
keywords: smallprint printgap noloewdin
keywords: NOSOSCF
formula: C16H22N4O3S
InChI: InChI=1/C16H22N4O3S/c1-6-19(7-2)16(21)20-10-17-15(18-20)24(22,23)14-12(4)8-11(3)9-13(14)5/h8-10H,6-7H2,1-5H3
46 atoms
S  1.259096 2.11988 0.229323
O  1.974388 2.694938 1.357041
O  0.976466 2.979654 -0.908622
O  -4.248768 -0.004711 1.108156
N  -2.879514 -1.536518 0.147244
N  -2.058794 0.513167 1.0057
N  -0.962494 0.613131 0.255512
N  -0.913944 2.11678 1.919977
C  2.002849 0.584683 -0.27825
C  2.242822 0.30593 -1.635588
C  2.292421 -0.35402 0.732212
C  3.03117 -1.909399 -0.984331
C  2.759625 -0.948407 -1.946597
C  2.798202 -1.587883 0.34586
C  -0.315617 1.571827 0.848495
C  1.99939 1.234481 -2.793797
C  2.099962 -0.128049 2.206228
C  -4.036862 -2.336473 -0.2655
C  -1.563434 -2.150605 -0.043329
C  -3.151855 -0.380824 0.748817
C  3.528473 -3.265804 -1.374386
C  -2.025004 1.434454 1.99018
C  -4.744099 -1.791674 -1.49354
C  -1.103595 -2.140351 -1.488224
H  2.952105 -1.180115 -2.987589
H  3.01703 -2.320695 1.11369
H  -3.66626 -3.339564 -0.470088
H  -4.733562 -2.427715 0.568923
H  -0.828267 -1.674156 0.597611
H  -1.648123 -3.179245 0.312475
H  0.943255 1.464269 -2.924572
H  2.535157 2.17577 -2.697438
H  2.343616 0.756405 -3.709358
H  1.089871 0.18259 2.476411
H  2.293011 -1.055905 2.741916
H  2.785383 0.623942 2.595788
H  4.187287 -3.219501 -2.24115
H  4.067764 -3.747611 -0.559684
H  2.691687 -3.916054 -1.640018
H  -2.804952 1.551607 2.725398
H  -5.178659 -0.808419 -1.317198
H  -4.065918 -1.718194 -2.344084
H  -5.556775 -2.46424 -1.771136
H  -1.042622 -1.126566 -1.88044
H  -0.113106 -2.592238 -1.56004
H  -1.772476 -2.717486 -2.12789
elementType: S O N C H
totalener: -1465.94548208 hartree
nucrepener: 2432.77925764 hartree
electener: -3898.72473972 hartree
oneelecener: -6839.01735203 hartree
twoeener: 2940.29261231 hartree
cpcmener: -0.04005402 hartree
kineticenergy: 1460.50367392 hartree
xcener: -121.656276165977 hartree
chargesum: 0.0000000
charge: 0.864553 -0.524718 -0.523568 -0.488391 -0.121617 0.120458 -0.294236 -0.344588 -0.236256 0.160146 0.073499 0.044849 -0.223858 -0.193760 0.081839 -0.197756 -0.245374 -0.037308 -0.007847 0.386776 -0.202728 0.122832 -0.254924 -0.298055 0.117584 0.121277 0.097909 0.098761 0.095973 0.104407 0.103424 0.108792 0.089985 0.121533 0.095149 0.126272 0.102030 0.098804 0.105669 0.179831 0.090310 0.086569 0.099181 0.095511 0.097563 0.103497
qa: 0.8646 -0.5247 -0.5236 -0.4884 -0.1216 0.1205 -0.2942 -0.3446 -0.2363 0.1601 0.0735 0.0448 -0.2239 -0.1938 0.0818 -0.1978 -0.2454 -0.0373 -0.0078 0.3868 -0.2027 0.1228 -0.2549 -0.2981 0.1176 0.1213 0.0979 0.0988 0.0960 0.1044 0.1034 0.1088 0.0900 0.1215 0.0951 0.1263 0.1020 0.0988 0.1057 0.1798 0.0903 0.0866 0.0992 0.0955 0.0976 0.1035
va: 5.5824 1.9583 1.9569 2.0276 3.2365 3.3513 2.8973 3.0659 3.6316 3.5754 3.6481 3.6881 3.9593 3.9559 4.1149 3.8592 3.8817 3.8548 3.8311 4.2625 3.8894 4.0272 3.9136 3.9067 1.0131 1.0111 0.9998 1.0115 1.0099 0.9988 1.0058 1.0061 1.0046 0.9930 1.0051 1.0016 1.0007 1.0034 0.9942 0.9962 1.0103 1.0026 1.0055 1.0089 1.0059 1.0059
dispcorr: -0.027014411 hartree
energy: -1465.972496491577
dipole: -1.93898 1.77031 -0.16867 -29.33961 24.32228 -5.01732 -14.03692 13.16101 -0.87591
magnitude: 5.09600 au
magnitude: 12.95300 debye
