program: Orca
programVersion: 5.0.2
elementType: S O O O N N N N C C C C C C C C C C C C C C C C H H H H H H H H H H H H H H H H H H H H H H
charge: 0
multiplicity: 1
keywords: wb97x-d3
keywords: def2-TZVPP
keywords: def2/J RIJCOSX
keywords: DEFGRID2
keywords: scfconv7
keywords: smallprint printgap noloewdin
keywords: NOSOSCF
formula: C16H22N4O3S
InChI: InChI=1/C16H22N4O3S/c1-6-19(7-2)16(21)20-10-17-15(18-20)24(22,23)14-12(4)8-11(3)9-13(14)5/h8-10H,6-7H2,1-5H3
46 atoms
S  1.165761 1.249455 -1.08593
O  0.851711 2.407628 -0.26552
O  1.515948 1.462355 -2.480194
O  -3.714314 -2.056901 -0.052455
N  -3.763762 -0.098855 1.089276
N  -2.080245 -0.583626 -0.519257
N  -1.166119 0.30492 -0.131815
N  -0.56283 -0.647583 -2.071563
C  2.403419 0.24416 -0.287193
C  3.195968 -0.62191 -1.067404
C  2.577508 0.34301 1.107489
C  4.459112 -1.194858 0.935797
C  4.213899 -1.31656 -0.424443
C  3.618223 -0.380522 1.67912
C  -0.290438 0.230117 -1.091104
C  3.027323 -0.895149 -2.538023
C  1.720216 1.136038 2.056939
C  -4.915154 -0.559112 1.869174
C  -3.434182 1.319207 1.250188
C  -3.262097 -0.959387 0.207074
C  5.596589 -1.920944 1.58193
C  -1.699539 -1.153808 -1.682878
C  -6.238729 -0.342975 1.157903
C  -2.564439 1.59221 2.46138
H  4.831853 -1.984043 -1.013664
H  3.766122 -0.309027 2.750271
H  -4.781759 -1.608722 2.126183
H  -4.901984 -0.007389 2.809221
H  -2.97787 1.710056 0.345803
H  -4.385513 1.844266 1.355345
H  3.404663 -0.081233 -3.154885
H  3.595543 -1.787005 -2.797088
H  1.993375 -1.077508 -2.823699
H  1.933524 0.815738 3.075463
H  1.922756 2.204234 2.004667
H  0.65444 0.991549 1.891285
H  6.518973 -1.34256 1.493853
H  5.417363 -2.086037 2.643713
H  5.776898 -2.886925 1.110477
H  -2.276776 -1.904282 -2.198016
H  -7.058379 -0.658154 1.804441
H  -6.397814 0.708743 0.915891
H  -6.302171 -0.919847 0.235597
H  -2.378927 2.663345 2.546242
H  -3.047093 1.269107 3.384856
H  -1.602778 1.088569 2.383661
elementType: S O N C H
totalener: -1465.94757198 hartree
nucrepener: 2359.76968274 hartree
electener: -3825.71725472 hartree
oneelecener: -6693.87114647 hartree
twoeener: 2868.15389175 hartree
cpcmener: -0.03566069 hartree
kineticenergy: 1460.48418012 hartree
xcener: -121.653539851730 hartree
chargesum: -0.0000000
charge: 0.858413 -0.523116 -0.523715 -0.497959 -0.131507 0.120059 -0.319124 -0.374344 -0.304443 0.163388 0.165184 0.065119 -0.223118 -0.226032 0.159160 -0.225378 -0.191161 -0.032925 -0.014707 0.407216 -0.206610 0.121121 -0.250625 -0.282166 0.119632 0.120536 0.093409 0.101592 0.101145 0.110813 0.108390 0.092401 0.105210 0.093571 0.109218 0.076880 0.108982 0.097135 0.099756 0.179153 0.097377 0.083231 0.086212 0.097336 0.092298 0.092992
qa: 0.8584 -0.5231 -0.5237 -0.4980 -0.1315 0.1201 -0.3191 -0.3743 -0.3044 0.1634 0.1652 0.0651 -0.2231 -0.2260 0.1592 -0.2254 -0.1912 -0.0329 -0.0147 0.4072 -0.2066 0.1211 -0.2506 -0.2822 0.1196 0.1205 0.0934 0.1016 0.1011 0.1108 0.1084 0.0924 0.1052 0.0936 0.1092 0.0769 0.1090 0.0971 0.0998 0.1792 0.0974 0.0832 0.0862 0.0973 0.0923 0.0930
va: 5.5962 1.9594 1.9666 2.0148 3.2489 3.3622 2.9359 3.0651 3.7383 3.6223 3.6324 3.7201 3.9843 3.9892 4.0292 3.8619 3.8739 3.8739 3.8228 4.2425 3.8955 4.0301 3.9150 3.9223 1.0115 1.0116 1.0126 0.9972 1.0157 0.9962 1.0017 1.0048 1.0176 1.0077 1.0042 0.9980 0.9939 1.0029 1.0009 0.9981 1.0056 1.0053 1.0115 1.0058 1.0073 0.9898
dispcorr: -0.023896619 hartree
energy: -1465.971468600306
dipole: -6.26094 5.48279 -0.77815 -3.01746 1.92708 -1.09039 19.26848 -16.79741 2.47106
magnitude: 2.81080 au
magnitude: 7.14450 debye
